program: Gaussian 09
title: 000288833
version: EM64L-G09RevD.01
frameworkgroup: C1[X(C18H19NO)]
method: RPBEPBE
basis: SDD
operation: Freq
keyword: #p
keyword: freq=noraman
keyword: PBEPBE/SDD
title: #p freq=noraman PBEPBE/SDD
converged: YES YES NO NO
title: Mulliken charges:
elementType: O N C C C C C C C C C C C C C C C C C C H H H H H H H H H H H H H H H H H H H
charge: -0.191489 -0.154533 -0.167540 -0.589822 -0.637357 0.315365 -0.054997 0.176317 0.547428 -0.392958 -0.374990 -0.453010 -0.420958 -0.214050 -0.230076 0.398234 -0.368633 -0.362749 -0.646623 -0.647078 0.266632 0.245981 0.240474 0.215945 0.246436 0.245797 0.273779 0.222560 0.227676 0.228347 0.233772 0.233180 0.233513 0.230820 0.231477 0.214879 0.232269 0.231179 0.214802
chargesum: 0.00000
title: Mulliken charges with hydrogens summed into heavy atoms:
elementType: O N C C C C C C C C C C C C C C C C C C
charge: -0.191489 -0.154533 0.099092 -0.103367 -0.174976 0.315365 -0.054997 0.176317 0.547428 -0.147161 -0.101211 -0.230450 -0.193282 0.014298 0.003696 0.398234 -0.135453 -0.129237 0.030553 0.031171
polarizability: 3.13791193e+02 -8.70548748e+00 1.92770602e+02 -1.46707471e+01 -6.74012819e+00 1.27844922e+02
1716.lowfreq: -14.0727 -5.3623 -0.0002 0.0006 0.0006 2.4110 14.0588 23.0285 26.8821
frequency: 12.7907 22.9893 26.8347 54.2685 74.3060 84.4488 108.0154 130.0416 157.9731 199.3207 200.8817 208.2681 220.9416 263.0509 310.9846 340.0124 366.7274 393.1939 416.2178 426.4954 467.3688 473.7224 483.0273 510.0768 521.9621 545.2353 591.5476 612.5428 636.6476 667.1505 700.3093 714.9665 731.1706 758.3776 785.3399 805.1001 808.1743 820.0636 850.0989 871.4400 873.1643 903.1728 934.3561 944.8706 949.5703 964.8160 997.5486 1001.0391 1002.2374 1017.7054 1041.9430 1055.5727 1085.9751 1092.2386 1109.9154 1112.4698 1115.5772 1143.8143 1164.0454 1166.6156 1181.3049 1191.5116 1200.0029 1215.6949 1223.6277 1229.2874 1264.8485 1275.8313 1287.6636 1296.2823 1309.8945 1331.8122 1356.9928 1380.4167 1397.8626 1423.6876 1436.4427 1445.8118 1452.6652 1458.8970 1462.3476 1466.3650 1473.1446 1473.4198 1495.2385 1507.8305 1528.1623 1565.7972 1594.3489 1608.2733 1627.5765 1635.2668 2930.6780 2939.7489 2979.9918 2987.4979 2992.8916 2993.2481 2996.4270 3041.2076 3049.0631 3090.9130 3101.1581 3106.7110 3109.7591 3123.6674 3137.2836 3149.0106 3157.9809 3162.3601 3164.4303
redmass: 3.8303 4.2165 3.8749 4.1400 2.3474 2.7362 2.0706 4.2695 4.9322 1.3395 2.4979 2.1774 2.7373 5.7969 3.5378 3.2051 2.6517 3.3280 2.9504 3.1098 3.1583 3.3894 3.6606 3.1140 2.9842 6.5696 3.5011 5.4324 6.7971 4.7273 3.8268 3.9372 2.4916 2.3035 2.4011 1.6473 1.5294 3.6759 2.7321 1.6435 2.5883 1.5571 1.3977 3.0759 1.3528 1.4612 2.8635 1.4012 2.5032 2.0878 2.9991 1.4997 2.5351 2.4299 1.3109 1.2431 1.3564 1.2149 1.7385 1.1542 1.5626 1.5484 1.1508 1.6975 1.3301 1.9776 2.8622 2.3287 1.4013 1.5944 1.5197 1.4179 3.3999 4.8605 7.5529 1.8834 1.5339 1.4368 2.1662 1.2150 1.0405 1.7685 1.0483 1.1319 1.0829 1.1040 2.6197 6.4858 7.0905 7.9361 10.3725 6.3145 1.0370 1.0398 1.0694 1.0712 1.0646 1.0987 1.1025 1.1018 1.0992 1.0956 1.0935 1.0894 1.0892 1.0860 1.0898 1.0947 1.0925 1.0931 1.1003
irintensity: 0.3769 0.8234 0.2799 0.4934 0.1289 6.2257 0.4683 2.1361 2.2561 0.1105 2.3908 1.5899 2.1829 4.9028 2.7268 2.6865 1.3167 0.5711 0.0720 7.5200 3.6797 3.8353 1.3985 11.6318 7.6987 3.1172 18.8886 8.9075 0.2334 3.7684 0.4901 1.3734 12.7256 47.7276 37.1428 21.5949 14.0598 20.9887 4.3680 7.6256 7.3139 1.5466 0.3068 20.7006 0.1708 2.4460 1.7413 1.7436 26.3687 1.0893 25.2086 29.1415 2.2662 33.5818 1.3515 0.1501 6.4165 3.8736 13.3120 4.2698 29.2998 3.4913 20.6857 21.0358 1.8393 0.9543 33.0283 80.6443 11.8903 3.9449 25.9133 7.8253 130.8896 6.7258 8.0746 5.9478 0.1498 8.7081 43.8842 14.6705 0.0521 1.7979 22.4377 4.0112 1.8736 30.2834 299.9844 5.0996 13.5596 135.2649 163.7427 134.5709 122.5120 100.3835 9.9991 17.4138 13.0258 10.3674 90.3308 9.6253 19.2730 4.8796 55.9993 14.0555 25.6784 1.3287 9.6344 17.8743 26.2337 12.6140 33.5058
temp: 298.150 k
press: 1.00000 atm
elementType: 8 7 6 6 6 6 6 6 6 6 6 6 6 6 6 6 6 6 6 6 1 1 1 1 1 1 1 1 1 1 1 1 1 1 1 1 1 1 1
symmnumber: 1
zpe: 843732.6 jmol-1
zpe.correction: 0.321361 hartree
zpe.thermalcorrener: 0.339707 hartree
zpe.thermalcorrenthalpy: 0.340652 hartree
zpe.thermalcorrgfe: 0.271828 hartree
zpe.sumelectzpe: -825.860236 hartree
zpe.sumelectthermal: -825.841889 hartree
zpe.sumelectthermalent: -825.840945 hartree
zpe.sumelectthermalfe: -825.909769 hartree
dipole: 3.0162 -4.4231 -1.1167
dipole: 5.4688
quadrupole: -87.7006 -121.7417 -117.9270
quadrupole: 7.0122 -3.0802 -4.5833
quadrupole: 21.4225 -12.6186 -8.8039 7.0122 -3.0802 -4.5833
hfenergy: -826.1815969 hartree
pointgroup: C01 [X(C18H19N1O1)]
dipole: 1.1325807 1.6478368 0.7945233 debye
polarizability: 313.154383|9.1184602|193.1820458|17.0099879|7.4394943|128.070288 unknown
InChI: InChI=1S/C18H19NO/c1-19(2)16-9-7-13(8-10-16)11-15-12-14-5-3-4-6-17(14)18(15)20/h3-10,15H,11-12H2,1-2H3
charge 0 multiplicity 1
39 atoms
O  -2.654391 -2.598497 -0.828187
N  5.2978 0.633762 0.354917
C  -1.095611 -0.8223 -0.016953
C  -1.386705 0.659099 0.370751
C  -0.065028 -1.024116 -1.167715
C  -2.906218 0.771368 0.394007
C  -2.473625 -1.439705 -0.361874
C  -3.518021 -0.430352 -0.045739
C  1.343911 -0.594693 -0.789286
C  -3.711556 1.870584 0.760162
C  -4.922979 -0.562764 -0.138583
C  1.920195 0.600021 -1.286745
C  2.134167 -1.370718 0.09785
C  -5.119079 1.744505 0.676179
C  -5.724236 0.538161 0.22875
C  4.007317 0.233974 -0.019773
C  3.216148 1.015419 -0.919432
C  3.430612 -0.978477 0.47896
C  5.863605 1.875686 -0.180778
C  6.090655 -0.201382 1.262776
H  -0.716043 -1.371338 0.868969
H  -0.954389 1.351474 -0.377474
H  -0.935941 0.935262 1.340928
H  -0.409951 -0.457247 -2.054411
H  -0.092774 -2.096187 -1.443018
H  -3.260752 2.808831 1.10351
H  -5.360363 -1.504969 -0.485651
H  1.346982 1.219768 -1.988927
H  1.730846 -2.312708 0.493191
H  -5.755786 2.590718 0.959689
H  -6.816163 0.469357 0.173393
H  3.61175 1.94399 -1.341041
H  3.997721 -1.620538 1.159133
H  5.249748 2.759657 0.090315
H  5.9497 1.850693 -1.287351
H  6.873237 2.02781 0.232897
H  6.278028 -1.211235 0.841744
H  5.592609 -0.33199 2.245868
H  7.067379 0.275883 1.441352
