program: Gaussian 09
title: 000288831
version: EM64L-G09RevD.01
frameworkgroup: C1[X(C16H23NO)]
method: RPBEPBE
basis: SDD
operation: Freq
keyword: #p
keyword: freq=noraman
keyword: PBEPBE/SDD
title: #p freq=noraman PBEPBE/SDD
converged: YES YES NO NO
title: Mulliken charges:
elementType: O N C C C C C C C C C C C C C C C C H H H H H H H H H H H H H H H H H H H H H H H
charge: -0.276413 -0.405731 -0.031742 -0.422495 -0.451914 -0.401170 -0.409801 -0.377682 0.233268 -0.533915 -0.376620 -0.548744 0.505384 -0.407869 -0.416344 -0.228316 -0.227341 -0.243797 0.256871 0.240838 0.194512 0.202664 0.215543 0.197883 0.204708 0.209704 0.178089 0.194701 0.202076 0.293551 0.199650 0.226091 0.215737 0.255178 0.198452 0.202617 0.232833 0.228547 0.223006 0.221717 0.226273
chargesum: 0.00000
title: Mulliken charges with hydrogens summed into heavy atoms:
elementType: O N C C C C C C C C C C C C C C C C
charge: -0.276413 -0.112180 0.225130 0.012855 -0.033707 0.001421 -0.022007 0.019095 0.233268 -0.108174 0.094294 -0.147675 0.505384 -0.175036 -0.187797 -0.005310 -0.005623 -0.017524
polarizability: 2.29969469e+02 -5.12898385e+00 1.67714681e+02 -1.99797628e+01 1.36790717e+00 1.32669551e+02
1716.lowfreq: -14.2722 -7.2669 -0.0006 -0.0005 0.0004 5.0330 14.3899 21.1321 29.7775
frequency: -12.0170 19.7592 29.6172 46.3081 54.5548 67.6564 102.6660 119.1442 155.3087 195.9249 220.4551 225.6994 281.0480 311.7520 334.8513 361.7376 380.4146 403.1473 432.0564 460.1823 482.0524 503.7919 533.7120 564.1798 611.1038 617.4458 636.6152 704.2808 709.6363 752.9181 762.6187 778.9906 795.5515 814.3034 828.3145 846.9496 853.8627 862.0865 865.9335 914.5699 922.7052 939.5978 974.0411 983.0166 989.9607 992.0418 1012.8693 1025.0416 1029.7564 1032.9940 1046.7474 1051.1432 1059.2980 1086.3983 1089.2750 1114.6485 1122.6210 1150.4248 1159.5384 1171.2346 1186.4044 1210.5687 1217.4272 1243.0693 1246.4561 1259.1356 1265.9485 1271.5576 1288.5498 1304.4595 1319.3321 1327.0947 1329.9520 1334.3884 1338.1349 1346.2331 1350.1092 1355.8375 1371.1565 1382.3762 1439.9951 1448.9319 1456.7260 1464.5872 1465.7020 1470.0918 1470.5590 1475.9277 1483.2580 1487.0220 1488.4835 1593.0464 1609.8361 1614.1966 2948.7492 2968.2857 2969.9303 2971.0871 2972.1453 2979.2042 2982.5737 2995.8074 3022.1838 3024.4989 3026.7756 3027.3028 3030.5855 3038.1239 3043.9829 3055.6570 3070.1568 3112.4062 3115.0993 3130.4528 3142.1070 3161.2273 3546.7852
redmass: 4.0342 3.7106 5.0618 4.6089 3.4297 4.5666 2.0984 2.7552 4.1552 3.3713 4.9200 2.4192 2.5235 4.0466 2.3412 1.9362 2.4959 2.8102 2.7628 2.4963 2.0098 3.2227 1.5400 2.6271 3.6212 6.3569 2.3068 1.9120 3.8054 1.1602 1.9997 1.5412 3.3447 3.7746 1.6357 1.3814 1.2939 2.3027 2.3514 1.4623 1.7147 2.1881 1.3900 2.5775 5.6721 1.3442 2.7627 2.4381 1.9836 2.9646 1.5562 1.7670 2.3190 1.5578 1.7168 1.0411 1.1994 2.0829 1.9035 1.0519 1.1176 1.5565 2.3851 1.3351 1.3479 1.2845 1.2838 1.3007 1.1698 1.5841 1.4393 1.2568 1.3372 1.5284 1.4207 1.4952 1.4735 1.4967 1.3584 7.8902 2.1746 1.1052 1.1621 1.3330 1.2779 1.0852 1.1075 1.0870 2.2461 1.1032 1.1723 6.0559 6.4089 6.1929 1.0680 1.0621 1.0594 1.0632 1.0589 1.0637 1.0619 1.0637 1.0966 1.0884 1.1016 1.0930 1.0948 1.1009 1.1018 1.0998 1.1037 1.0868 1.0870 1.0908 1.0958 1.1015 1.0775
irintensity: 0.0489 0.1891 2.5516 3.8842 0.6919 1.5627 0.2051 3.2962 3.8463 0.1190 6.7516 1.6480 0.0323 13.1833 0.3302 0.9422 0.2434 0.0006 5.0035 3.6783 1.9329 13.4473 59.4167 21.6435 5.3441 0.0888 3.9662 46.6154 11.3235 7.9453 38.6890 0.6843 2.1786 0.5462 2.7420 0.4375 0.1523 7.3417 6.6346 1.7803 11.2565 12.7409 0.0131 3.8990 0.2348 0.1491 4.3681 2.5249 9.9681 1.6172 1.3118 1.1970 4.3341 4.7808 0.8389 1.7519 10.0534 8.2724 7.6750 0.1209 0.3222 19.4604 0.4540 5.7322 43.2609 3.9108 8.0820 14.6777 1.7954 9.1377 3.0195 0.0633 0.0498 10.9353 1.2206 8.5551 6.3196 4.8681 5.1813 0.1088 6.8124 9.9944 69.3211 121.4829 170.2697 9.9682 0.9047 25.0251 16.1979 16.6207 47.6261 1.2373 144.9974 14.1842 35.2350 38.1683 4.7836 23.8778 53.5010 21.0642 27.6401 32.3511 23.2949 49.8007 8.5899 67.8731 34.8319 31.3032 75.7871 53.6304 36.7426 9.9524 7.7699 11.4764 47.4327 25.3357 16.5651
temp: 298.150 k
press: 1.00000 atm
elementType: 8 7 6 6 6 6 6 6 6 6 6 6 6 6 6 6 6 6 1 1 1 1 1 1 1 1 1 1 1 1 1 1 1 1 1 1 1 1 1 1 1
symmnumber: 1
zpe: 938148.8 jmol-1
zpe.correction: 0.357322 hartree
zpe.thermalcorrener: 0.374066 hartree
zpe.thermalcorrenthalpy: 0.375010 hartree
zpe.thermalcorrgfe: 0.310542 hartree
zpe.sumelectzpe: -752.129847 hartree
zpe.sumelectthermal: -752.113103 hartree
zpe.sumelectthermalent: -752.112159 hartree
zpe.sumelectthermalfe: -752.176627 hartree
dipole: -2.1255 2.8278 2.0524
dipole: 4.0898
quadrupole: -98.1710 -108.3612 -111.7623
quadrupole: -4.4123 -3.3155 -3.5801
quadrupole: 7.9272 -2.2630 -5.6642 -4.4123 -3.3155 -3.5801
hfenergy: -752.4871694 hartree
pointgroup: C01 [X(C16H23N1O1)]
dipole: -0.8123376 1.1694133 0.7493806 debye
polarizability: 229.4009838|-7.1837443|167.9519798|-20.5528445|-0.3094597|133.000737 unknown
InChI: InChI=1S/C16H23NO/c18-16(17-15-11-5-2-6-12-15)13-7-10-14-8-3-1-4-9-14/h1,3-4,8-9,15,17H,2,5-7,10-13H2
charge 0 multiplicity 1
41 atoms
O  -1.177682 -1.719797 -0.824943
N  -2.397467 0.06425 0.030505
C  -3.565613 -0.148519 -0.856751
C  -4.537542 -1.214996 -0.279102
C  -4.298773 1.193885 -1.098423
C  -5.278807 -0.712229 0.981505
C  -5.049307 1.698163 0.160836
C  -6.017778 0.620312 0.706818
C  -1.27525 -0.744591 -0.014934
C  -0.156307 -0.389202 0.972018
C  1.219943 -0.298458 0.270654
C  2.382512 -0.120082 1.285277
C  3.736467 -0.007658 0.59958
C  4.494593 -1.168276 0.296309
C  4.252352 1.254975 0.207832
C  5.731916 -1.072434 -0.379562
C  5.489028 1.357083 -0.468976
C  6.233946 0.19219 -0.76576
H  -3.15435 -0.534289 -1.80808
H  -3.9686 -2.138151 -0.066491
H  -5.278282 -1.464189 -1.066484
H  -5.036441 1.035037 -1.909536
H  -3.580208 1.954439 -1.460561
H  -4.549043 -0.566447 1.804568
H  -5.994537 -1.48181 1.328561
H  -5.602553 2.625285 -0.083264
H  -4.327016 1.97565 0.958787
H  -6.819037 0.444632 -0.040799
H  -6.513291 0.983795 1.627808
H  -2.427742 0.831501 0.703645
H  -0.377006 0.55391 1.511152
H  -0.114489 -1.195374 1.732225
H  1.22332 0.546038 -0.445745
H  1.371849 -1.217842 -0.323519
H  2.190828 0.784578 1.896489
H  2.378108 -0.983949 1.979471
H  4.111996 -2.152693 0.594334
H  3.682457 2.164027 0.439462
H  6.304223 -1.980309 -0.602412
H  5.872791 2.34158 -0.760834
H  7.194095 0.269163 -1.28836
