program: Gaussian 09
title: 000288829
version: EM64L-G09RevD.01
frameworkgroup: C1[X(C17H19NO2)]
method: RPBEPBE
basis: SDD
operation: Freq
keyword: #p
keyword: freq=noraman
keyword: PBEPBE/SDD
title: #p freq=noraman PBEPBE/SDD
converged: YES YES NO NO
title: Mulliken charges:
elementType: O O N C C C C C C C C C C C C C C C C C H H H H H H H H H H H H H H H H H H H
charge: -0.464810 -0.280356 -0.371906 -0.441244 -0.219306 -0.551650 0.504037 0.259724 -0.525404 -0.461519 -0.379513 0.483086 -0.235228 -0.227004 -0.243472 -0.440900 -0.364791 -0.217772 -0.226098 -0.242540 0.223668 0.231087 0.222547 0.235624 0.243737 0.225699 0.266517 0.304813 0.245427 0.263664 0.338856 0.228769 0.223877 0.227091 0.232064 0.240293 0.228217 0.233165 0.231551
chargesum: 0.00000
title: Mulliken charges with hydrogens summed into heavy atoms:
elementType: O O N C C C C C C C C C C C C C C C C C
charge: -0.125954 -0.280356 -0.067093 0.013512 0.003240 -0.072289 0.504037 0.259724 -0.033188 -0.216092 -0.115849 0.483086 -0.006459 -0.003127 -0.016381 -0.208836 -0.124498 0.010445 0.007067 -0.010989
polarizability: 2.23318473e+02 2.13539158e+01 1.99843533e+02 -1.16663408e+01 -7.26980469e+00 1.39467352e+02
1716.lowfreq: -15.5365 -9.1357 -4.8902 -0.0004 0.0003 0.0005 12.8909 17.6232 27.8012
frequency: -6.4335 16.1225 27.3375 39.7348 45.1391 49.9191 91.6020 97.5550 179.6524 192.0200 207.1848 224.8847 262.4293 282.5910 304.5164 324.9763 346.9809 380.6921 403.9363 404.5916 423.9511 475.0999 507.6884 547.1252 557.1293 582.5437 592.3732 609.2995 615.9455 618.2979 668.8293 706.0957 707.4623 750.3005 756.7792 770.1496 805.7513 852.5499 855.6826 857.0203 858.7018 919.2786 921.6837 973.0773 978.7846 979.4089 981.6517 989.4359 990.5107 995.9627 998.1017 1001.2868 1016.0168 1025.2932 1026.4324 1049.4294 1080.7554 1086.9006 1101.8044 1152.8794 1162.0482 1171.5054 1173.1500 1184.7074 1186.7594 1198.1351 1216.1864 1223.3600 1232.3549 1236.7199 1302.4436 1318.6631 1321.1952 1336.2568 1343.6157 1356.9479 1381.0861 1387.0073 1399.6456 1439.2778 1441.1628 1442.2958 1447.5719 1469.9760 1483.1153 1485.4044 1488.6095 1594.1421 1595.5500 1611.6957 1614.6950 1615.2970 2958.5028 2986.2546 2987.3724 2991.3998 3045.0283 3047.4249 3059.9218 3113.1059 3116.0571 3120.1995 3125.0291 3134.2186 3137.9801 3146.1641 3153.8651 3164.2389 3165.4507 3545.9753 3555.9698
redmass: 4.7624 5.0314 4.8321 5.1506 4.5130 4.4624 5.3739 4.4317 4.4812 3.7802 4.0969 3.6622 4.1788 3.2096 2.3528 1.2360 2.9331 3.2474 2.8210 2.8336 3.1753 4.2626 3.1500 3.0424 2.9023 3.6262 2.8724 1.5797 5.6774 6.0986 3.1863 1.7398 1.8058 3.5827 1.9146 1.8576 3.7644 2.0872 2.4370 1.4085 1.2945 1.3996 1.4390 2.2776 1.3944 1.4619 4.7277 4.7862 5.0949 1.4523 1.3769 2.2467 2.4282 2.1864 2.1845 3.3017 1.6903 1.5813 2.8403 1.3527 1.2831 1.0558 1.0546 1.1164 1.1169 1.4351 2.6455 1.6008 1.2426 1.4378 1.1677 1.3484 1.3272 1.3810 1.3977 1.5155 5.0205 5.7478 1.6990 1.7597 1.1480 2.0267 1.2486 1.1947 2.1590 2.3774 1.7899 6.1149 6.0676 6.0759 6.1253 6.0092 1.0843 1.0604 1.0596 1.0619 1.1001 1.1004 1.1029 1.0869 1.0875 1.0869 1.0867 1.0907 1.0924 1.0958 1.0958 1.1014 1.0998 1.0779 1.0659
irintensity: 0.7188 0.0205 0.8941 3.4603 1.3274 1.9992 4.4085 1.5717 1.7513 4.5536 1.8568 7.6666 1.4741 8.5410 14.0353 120.6716 5.7002 5.4154 0.4727 0.3495 2.1061 13.0544 41.2399 0.8530 11.7026 4.7643 23.3356 102.2700 5.5953 1.1980 1.5459 56.2756 43.8677 7.4852 46.5110 54.7096 9.9334 12.0316 5.4630 5.6895 2.8030 7.0701 6.2949 7.6092 0.2043 3.5355 56.1985 2.4720 0.2236 0.6631 0.8988 26.4316 2.9767 4.9469 8.2284 4.8517 3.9995 18.1792 0.4255 42.9458 40.9573 1.0336 0.1340 2.9373 0.3686 7.8552 2.8981 40.4412 40.2865 47.8880 1.2719 10.8361 0.8735 4.4159 8.9455 12.9373 5.3575 3.0350 17.1582 20.6500 34.4457 13.0210 3.8438 46.3009 50.3558 7.3544 139.3237 0.9817 1.2076 136.6321 4.9822 11.9688 43.7001 63.5518 8.8740 18.2684 18.7628 8.4992 29.0765 7.0630 8.6503 7.1652 1.0929 9.0910 29.2090 41.1345 24.4770 20.3990 15.7377 14.3641 6.7675
temp: 298.150 k
press: 1.00000 atm
elementType: 8 8 7 6 6 6 6 6 6 6 6 6 6 6 6 6 6 6 6 6 1 1 1 1 1 1 1 1 1 1 1 1 1 1 1 1 1 1 1
symmnumber: 1
zpe: 841477.6 jmol-1
zpe.correction: 0.320502 hartree
zpe.thermalcorrener: 0.338270 hartree
zpe.thermalcorrenthalpy: 0.339214 hartree
zpe.thermalcorrgfe: 0.272045 hartree
zpe.sumelectzpe: -862.963580 hartree
zpe.sumelectthermal: -862.945812 hartree
zpe.sumelectthermalent: -862.944868 hartree
zpe.sumelectthermalfe: -863.012037 hartree
dipole: 1.6430 1.2022 -3.1597
dipole: 3.7587
quadrupole: -111.4017 -119.3493 -116.0113
quadrupole: 7.9091 0.1324 2.1006
quadrupole: 4.1858 -3.7619 -0.4239 7.9091 0.1324 2.1006
hfenergy: -863.2840819 hartree
pointgroup: C01 [X(C17H19N1O2)]
dipole: -0.5210148 -0.6377715 -1.2282661 debye
polarizability: 218.6595116|23.5145803|203.6045306|15.0625755|3.2221775|140.365316 unknown
InChI: InChI=1S/C17H19NO2/c19-16(15-9-5-2-6-10-15)11-12-17(20)18-13-14-7-3-1-4-8-14/h1-10,16,18-19H,11-13H2
charge 0 multiplicity 1
39 atoms
O  3.216433 1.516735 2.040324
O  -0.434794 3.157083 0.040402
N  -1.09715 1.402589 -1.339597
C  2.329696 2.221941 -0.157357
C  2.235656 1.176911 0.988419
C  1.295439 2.010847 -1.283553
C  2.553675 -0.236831 0.524622
C  -0.140463 2.243542 -0.793311
C  -2.53245 1.517169 -1.019504
C  1.513134 -1.151049 0.227744
C  3.899853 -0.642292 0.342459
C  -3.108118 0.245971 -0.404841
C  1.809246 -2.445987 -0.25829
C  4.197389 -1.936377 -0.137237
C  3.153385 -2.84122 -0.445836
C  -4.205801 -0.414873 -1.00795
C  -2.560727 -0.286263 0.791858
C  -4.749982 -1.585759 -0.429971
C  -3.099973 -1.455227 1.370331
C  -4.197044 -2.110012 0.760005
H  2.160625 3.229004 0.272691
H  3.352679 2.192065 -0.576643
H  1.207703 1.209885 1.408847
H  1.405878 1.005312 -1.73136
H  1.49082 2.748608 -2.086491
H  -3.098737 1.784882 -1.932545
H  -2.604972 2.368124 -0.316463
H  -0.796974 0.648473 -1.960483
H  0.467296 -0.861565 0.392499
H  4.701807 0.052992 0.610804
H  3.056611 2.452983 2.324283
H  0.99441 -3.145539 -0.477307
H  5.241754 -2.243579 -0.265247
H  3.38586 -3.846111 -0.816288
H  -4.639108 -0.01131 -1.931894
H  -1.72215 0.229821 1.276032
H  -5.600278 -2.086232 -0.906723
H  -2.671712 -1.852738 2.297376
H  -4.616417 -3.016776 1.209896
