program: Gaussian 09
title: 000288817
version: EM64L-G09RevD.01
frameworkgroup: C1[X(C18H22)]
method: RPBEPBE
basis: SDD
operation: Freq
keyword: #p
keyword: freq=noraman
keyword: PBEPBE/SDD
title: #p freq=noraman PBEPBE/SDD
converged: NO YES NO NO
title: Mulliken charges:
elementType: C C C C C C C C C C C C C C C C C C H H H H H H H H H H H H H H H H H H H H H H
charge: -0.198166 -0.443411 -0.443414 -0.401763 -0.401758 -0.383136 0.484837 0.161054 -0.730619 0.232717 0.329151 0.114208 -0.416983 -0.403500 -0.862382 -0.864472 -0.266095 -0.266778 0.189043 0.218269 0.197791 0.197825 0.218274 0.191856 0.200345 0.200348 0.191854 0.187750 0.198744 0.228250 0.225165 0.245552 0.231466 0.234910 0.231482 0.254008 0.234790 0.234823 0.223929 0.224038
chargesum: 0.00000
title: Mulliken charges with hydrogens summed into heavy atoms:
elementType: C C C C C C C C C C C C C C C C C C
charge: -0.009123 -0.027351 -0.027315 -0.009561 -0.009556 0.003358 0.484837 0.161054 -0.502369 0.232717 0.329151 0.114208 -0.191817 -0.157948 -0.164525 -0.140852 -0.042166 -0.042741
polarizability: 2.43050645e+02 8.20612165e+00 2.29249215e+02 1.34788353e-02 1.31427428e-02 1.18775163e+02
1716.lowfreq: -16.9917 -0.0007 -0.0005 0.0006 7.7374 10.8612 16.4408 56.4916 78.8184
frequency: 6.6586 56.2557 78.7995 107.5869 120.7877 161.5345 179.1101 194.1212 211.8213 212.2404 224.3894 262.0077 300.1017 334.0507 345.0264 376.9697 426.4747 433.0520 435.1168 450.9140 472.8395 486.1089 511.9143 556.7233 595.6839 628.3095 661.2738 662.7879 696.9518 768.5497 778.8358 782.0147 801.2498 810.7136 849.7352 875.0071 876.5610 885.1608 889.7290 903.2509 925.4123 957.8191 974.0053 987.6346 1002.7372 1025.1772 1031.2640 1044.0317 1049.7957 1049.8990 1053.1543 1068.2114 1073.3048 1088.3270 1109.6610 1134.8150 1176.5339 1179.4688 1180.5043 1230.7955 1238.7084 1256.7818 1257.6402 1267.9908 1276.6130 1300.9472 1314.0748 1324.1052 1333.1262 1339.9257 1344.8380 1353.3777 1365.5955 1386.1469 1398.1998 1402.7852 1409.4238 1429.8398 1452.9007 1458.6172 1461.0131 1461.3125 1468.0558 1468.7793 1471.4833 1477.4722 1493.6880 1494.0061 1520.8511 1586.5295 1603.6067 1623.0462 2961.4572 2961.8561 2963.6297 2968.1534 2970.1967 2971.4785 2972.1772 2993.9238 3021.5861 3024.0402 3030.4873 3033.3154 3039.9407 3044.4560 3047.8518 3077.0870 3104.3293 3115.6946 3123.0902 3138.6048 3155.1832 3165.3692
redmass: 3.1697 3.2735 3.3412 3.1595 2.2784 1.1986 1.1507 2.8435 2.7852 4.0287 1.8089 3.3253 3.6050 1.8195 2.4979 3.3993 3.0427 4.9934 2.7178 3.3069 4.1413 1.9102 3.2158 2.8988 5.4036 3.2933 4.0153 3.1806 4.5350 1.4085 2.5164 1.4575 2.2543 3.8866 1.9235 2.4942 1.8351 1.5463 2.1558 1.4083 1.9322 1.3731 2.6811 1.3233 1.6051 1.4424 2.3235 2.3687 1.9742 1.3246 1.6129 1.3016 2.0376 2.9908 2.4467 2.3355 1.6948 1.0948 1.4863 1.4161 1.4186 1.2933 2.0396 1.4435 2.1544 1.2382 1.4448 1.3290 1.3748 1.4915 1.4977 1.6488 3.8052 2.0322 1.4984 1.2194 3.3270 3.2941 2.0133 1.0884 1.0974 1.0897 1.0898 1.0468 1.3149 1.1062 1.0792 1.0474 3.4154 6.6276 5.7580 6.2332 1.0621 1.0617 1.0635 1.0613 1.0638 1.0381 1.0400 1.0811 1.0973 1.0944 1.1013 1.1031 1.0971 1.1025 1.0976 1.0981 1.0942 1.0894 1.0848 1.0886 1.0935 1.0992
irintensity: 0.0598 0.1748 0.0355 1.1683 0.2016 0.0121 2.4796 0.3214 1.8207 0.2345 0.0063 0.0870 0.9387 0.0226 0.2951 1.8232 0.9280 1.1260 0.2734 4.6073 1.7723 0.4917 0.0201 1.0970 0.4532 6.1590 0.6559 0.0096 2.9330 75.1769 0.9316 0.3226 3.6387 1.8106 5.5830 1.3688 7.5499 15.9750 4.6386 0.3757 0.4679 1.0542 15.9290 0.0328 8.0646 6.1052 16.5300 0.1420 1.5027 0.0103 0.9961 0.1236 0.3713 2.2879 0.0001 3.7367 0.2783 1.0926 0.5616 0.5306 1.0558 1.7943 2.4363 1.3264 4.9331 0.1451 6.1336 0.0103 0.1048 0.5014 1.0628 1.2654 0.6488 12.6630 15.4857 15.2025 8.1779 4.1993 1.1061 1.3160 6.4153 9.1895 22.8782 23.4382 12.0930 3.0890 11.0125 0.8195 9.2176 1.9794 22.0370 3.6417 30.0265 48.0322 38.0295 19.9594 7.1670 26.9164 53.3334 19.5239 86.4369 82.1426 11.3489 6.8099 21.6531 113.1904 18.3953 19.4740 20.4308 31.1419 1.2049 11.8548 39.0305 30.1949
temp: 298.150 k
press: 1.00000 atm
elementType: 6 6 6 6 6 6 6 6 6 6 6 6 6 6 6 6 6 6 1 1 1 1 1 1 1 1 1 1 1 1 1 1 1 1 1 1 1 1 1 1
symmnumber: 1
zpe: 913219.4 jmol-1
zpe.correction: 0.347827 hartree
zpe.thermalcorrener: 0.364232 hartree
zpe.thermalcorrenthalpy: 0.365176 hartree
zpe.thermalcorrgfe: 0.302959 hartree
zpe.sumelectzpe: -697.818210 hartree
zpe.sumelectthermal: -697.801805 hartree
zpe.sumelectthermalent: -697.800861 hartree
zpe.sumelectthermalfe: -697.863077 hartree
dipole: 0.1562 0.6740 0.0000
dipole: 0.6919
quadrupole: -99.6853 -100.3246 -113.7763
quadrupole: -1.8155 0.0014 0.0004
quadrupole: 4.9101 4.2708 -9.1809 -1.8155 0.0014 0.0004
hfenergy: -698.1660365 hartree
pointgroup: C01 [X(C18H22)]
dipole: 0.0691 -0.2632922 0.0000138 debye
polarizability: 243.5126698|-7.7942518|228.7871898|-0.0138526|0.0127482|118.7751627 unknown
InChI: InChI=1S/C18H22/c1-13-12-18(15-8-4-3-5-9-15)17-11-7-6-10-16(17)14(13)2/h6-7,10-12,15H,3-5,8-9H2,1-2H3
charge 0 multiplicity 1
40 atoms
C  1.805818 0.299221 -0.00041
C  2.564791 -0.171781 -1.276177
C  2.564524 -0.171127 1.275766
C  4.033631 0.314749 -1.275742
C  4.033372 0.315371 1.275405
C  4.780438 -0.142162 0.000018
C  0.343997 -0.156575 -0.000346
C  -0.772873 0.764122 -0.000058
C  0.06277 -1.527695 -0.000484
C  -2.127893 0.233159 0.000144
C  -1.262423 -2.068534 -0.000277
C  -2.365496 -1.193316 0.000119
C  -0.602911 2.191784 0.000031
C  -3.227135 1.159725 0.000309
C  -1.423816 -3.582317 -0.000453
C  -3.792838 -1.717627 0.000466
C  -1.694005 3.062646 0.000237
C  -3.02316 2.540341 0.000351
H  1.849864 1.405477 -0.000711
H  2.035598 0.193382 -2.177651
H  2.547419 -1.279762 -1.323813
H  2.547077 -1.279086 1.323949
H  2.035145 0.194508 2.17694
H  4.052103 1.423616 -1.330023
H  4.554132 -0.057327 -2.179888
H  4.553678 -0.056276 2.179838
H  4.051848 1.424263 1.329151
H  4.858019 -1.249618 0.000295
H  5.815663 0.251602 0.000027
H  0.89724 -2.240285 -0.000742
H  0.406796 2.612397 -0.000077
H  -4.250481 0.772117 0.000351
H  -1.977075 -3.939433 -0.889876
H  -0.439027 -4.080071 -0.001685
H  -1.975023 -3.939821 0.890108
H  -3.82382 -2.817757 0.001619
H  -4.353106 -1.369693 0.889804
H  -4.35286 -1.37153 -0.889768
H  -1.53404 4.146752 0.000293
H  -3.878249 3.225861 0.000464
