program: Gaussian 09
title: 000288818
version: EM64L-G09RevD.01
frameworkgroup: C1[X(C19H19NO)]
method: RPBEPBE
basis: SDD
operation: Freq
keyword: #p
keyword: freq=noraman
keyword: PBEPBE/SDD
title: #p freq=noraman PBEPBE/SDD
converged: YES YES NO NO
title: Mulliken charges:
elementType: O N C C C C C C C C C C C C C C C C C C C H H H H H H H H H H H H H H H H H H H
charge: -0.207597 -0.169344 -0.353850 -0.275861 0.014833 0.499709 -0.455109 -0.446880 -0.029782 0.016283 -0.396540 -0.395586 0.229920 -0.387070 -0.484153 0.440762 -0.400770 -0.242541 -0.457544 -0.445468 -0.240640 0.247492 0.267245 0.169985 0.212386 0.219064 0.201532 0.215591 0.205229 0.190682 0.190106 0.202964 0.199673 0.193634 0.243186 0.280494 0.229799 0.241500 0.241930 0.234738
chargesum: 0.00000
title: Mulliken charges with hydrogens summed into heavy atoms:
elementType: O N C C C C C C C C C C C C C C C C C C C
charge: -0.207597 -0.169344 -0.106358 -0.008616 0.184817 0.499709 -0.023659 -0.029757 -0.029782 0.016283 -0.000629 -0.002516 0.229920 0.006238 -0.240967 0.440762 -0.120276 -0.012743 -0.216044 -0.203538 -0.005902
polarizability: 2.65473564e+02 -5.99532222e+00 2.44330589e+02 3.21657011e+01 7.99452947e+00 1.36793091e+02
1716.lowfreq: -9.5307 -3.1680 -0.0007 -0.0005 0.0005 8.2400 37.4844 38.7393 61.5376
frequency: 37.2978 38.7077 61.5013 80.7593 119.5197 149.7355 173.2942 211.0950 223.2257 225.3976 265.4735 305.9496 333.2287 362.0640 391.7837 414.0162 426.1806 437.3916 447.1376 469.2337 472.3973 485.3115 513.5721 527.0310 551.4680 587.0162 623.7920 637.5180 671.8224 722.1003 761.4166 779.7465 785.9723 787.7665 794.5132 797.4808 808.7355 815.8408 847.7883 860.8518 878.8897 895.9150 905.0606 920.0498 922.7561 955.1376 970.8933 984.8562 994.8448 1002.6424 1037.4183 1042.8740 1046.3168 1051.7719 1076.7087 1082.8711 1087.3954 1106.6987 1111.2973 1133.8714 1157.2457 1167.4066 1186.2172 1190.8088 1195.8109 1230.2748 1241.9116 1249.6671 1253.1337 1257.7876 1287.0003 1304.3803 1307.3051 1323.6705 1332.6600 1339.4279 1340.1783 1343.4851 1356.2689 1369.2595 1384.3715 1405.6256 1420.7876 1435.1468 1461.9724 1462.2325 1464.2435 1464.7884 1472.5368 1481.0705 1519.3016 1566.4412 1588.1476 1605.5371 1628.3210 2848.1262 2964.8672 2967.2335 2971.1889 2980.4237 2983.8185 3028.6226 3032.1088 3037.2284 3042.0788 3050.4939 3073.4533 3106.1998 3122.8380 3126.4223 3131.7803 3146.3709 3158.9203 3164.0359
redmass: 3.4229 5.1687 3.8378 5.2877 3.8669 4.4492 4.1755 5.0109 2.5785 2.1900 3.4239 6.7985 2.0347 3.9019 6.5650 4.2976 4.4695 3.7954 2.6935 3.3922 3.7503 3.8394 1.9640 6.1970 6.3346 4.2689 3.7734 4.9865 4.0025 4.4118 1.6302 2.7724 3.0431 1.6190 3.4144 2.6076 4.6084 3.3532 1.9769 2.5379 1.6162 1.5667 2.2232 1.5104 1.8022 1.4281 3.1307 1.3881 2.1341 1.4280 2.0705 2.2053 1.7737 1.0793 1.9054 1.4338 2.9719 1.9255 2.5200 2.1312 2.0908 1.4335 1.2899 1.4491 1.4187 1.5219 1.3656 1.5907 1.2907 1.2753 2.2432 1.3415 1.2336 1.8073 1.4338 1.5087 1.6118 1.7078 1.8285 1.7029 3.4674 3.9805 5.0705 2.5422 1.7383 1.4133 1.0889 1.0928 1.0842 1.0941 4.8893 8.3715 6.1387 7.4283 7.1148 1.0812 1.0633 1.0643 1.0620 1.0602 1.0614 1.0970 1.0952 1.1017 1.1033 1.1031 1.0881 1.0903 1.0869 1.0878 1.0911 1.0912 1.0991 1.0985
irintensity: 0.0537 1.8096 0.1698 2.6365 0.1884 0.0542 3.2883 1.2981 0.3355 0.4131 1.2723 6.2768 0.6380 2.5138 2.4032 1.3739 0.9806 0.2834 5.6663 0.4092 1.6799 3.9034 0.8481 3.6670 4.4337 0.8088 8.2928 3.8588 6.6672 3.3439 15.3597 31.1769 15.5890 2.2406 4.2321 3.2295 24.4667 11.6590 8.9817 51.2398 1.1083 11.5772 4.6830 0.5973 0.4867 0.2337 1.8577 0.3716 14.0800 0.4846 1.9568 32.1225 0.0640 0.0966 1.4844 3.8585 55.9475 5.8443 0.5066 25.4130 6.2101 2.5866 9.3734 4.2788 0.7726 3.2384 1.6469 4.2208 2.7485 0.7589 91.9000 5.6838 2.4023 22.2742 1.6361 11.8647 2.6077 11.3652 35.4960 9.7808 3.0277 11.7274 4.5689 9.4531 9.0833 7.1159 7.2135 8.9367 21.4161 3.3246 30.0690 153.0693 7.7542 47.8901 5.6428 68.6640 36.4440 44.1971 35.0662 25.6347 18.9028 68.4649 76.9729 9.9296 2.5310 108.9269 16.5943 17.9105 5.2156 2.0224 16.2230 10.2049 33.1012 23.1243
temp: 298.150 k
press: 1.00000 atm
elementType: 8 7 6 6 6 6 6 6 6 6 6 6 6 6 6 6 6 6 6 6 6 1 1 1 1 1 1 1 1 1 1 1 1 1 1 1 1 1 1 1
symmnumber: 1
zpe: 866957.9 jmol-1
zpe.correction: 0.330207 hartree
zpe.thermalcorrener: 0.346799 hartree
zpe.thermalcorrenthalpy: 0.347743 hartree
zpe.thermalcorrgfe: 0.285802 hartree
zpe.sumelectzpe: -863.888976 hartree
zpe.sumelectthermal: -863.872384 hartree
zpe.sumelectthermalent: -863.871439 hartree
zpe.sumelectthermalfe: -863.933381 hartree
dipole: 0.2796 3.7763 0.0381
dipole: 3.7868
quadrupole: -104.7867 -126.8868 -123.2609
quadrupole: -2.0418 8.1249 6.0331
quadrupole: 13.5247 -8.5753 -4.9494 -2.0418 8.1249 6.0331
hfenergy: -864.2191827 hartree
pointgroup: C01 [X(C19H19N1O1)]
dipole: 0.1430208 1.477907 0.1222917 debye
polarizability: 265.6121412|-8.6933868|242.9641284|30.9456158|15.1228031|138.0209751 unknown
InChI: InChI=1S/C19H19NO/c21-19-15-11-5-7-12-6-4-10-14(16(12)15)17-18(19)20(17)13-8-2-1-3-9-13/h4-7,10-11,13,17-18H,1-3,8-9H2
charge 0 multiplicity 1
40 atoms
O  -0.539514 -3.184786 0.690201
N  1.205837 -0.160135 0.086736
C  0.369253 0.434387 1.211104
C  0.543012 -1.078657 1.112071
C  2.691658 -0.029413 0.253915
C  -0.925338 1.046167 0.802687
C  3.38323 -1.20041 -0.476587
C  3.139031 1.328963 -0.328523
C  -0.583731 -1.919887 0.590722
C  -1.908886 0.228269 0.141365
C  4.923385 -1.05927 -0.418443
C  4.67882 1.477814 -0.268067
C  -1.74968 -1.200648 -0.007756
C  5.384838 0.303848 -0.988405
C  -1.173715 2.409226 1.005545
C  -3.116901 0.850417 -0.357872
C  -2.73781 -1.95419 -0.663275
C  -2.374426 3.017922 0.529407
C  -3.322814 2.255305 -0.153604
C  -4.092304 0.045263 -1.031345
C  -3.902641 -1.331893 -1.190126
H  0.925535 0.943409 2.011351
H  1.200709 -1.585362 1.830044
H  2.982488 -0.064797 1.336321
H  3.044279 -1.197751 -1.531283
H  3.061672 -2.163975 -0.036468
H  2.64604 2.157446 0.217099
H  2.795899 1.384557 -1.380293
H  5.395531 -1.889722 -0.977263
H  5.264515 -1.149453 0.634204
H  5.007155 1.505264 0.792088
H  4.978925 2.442931 -0.719494
H  6.483563 0.404853 -0.897004
H  5.145798 0.345235 -2.070935
H  -0.425759 3.023486 1.520779
H  -2.59024 -3.03638 -0.743866
H  -2.540941 4.087507 0.695367
H  -4.24141 2.717534 -0.533377
H  -4.999773 0.527389 -1.414346
H  -4.655691 -1.936163 -1.706473
