program: Gaussian 09
title: 000288810
version: EM64L-G09RevD.01
frameworkgroup: C1[X(C19H16ClN)]
method: RPBEPBE
basis: SDD
operation: Freq
keyword: #p
keyword: freq=noraman
keyword: PBEPBE/SDD
title: #p freq=noraman PBEPBE/SDD
converged: YES YES NO NO
title: Mulliken charges:
elementType: Cl N C C C C C C C C C C C C C C C C C C C H H H H H H H H H H H H H H H H
charge: -0.059610 -0.027982 0.129519 -0.631260 0.352405 0.431700 0.197790 -0.758682 -0.726577 -0.245681 -0.391044 -0.510422 -0.393510 0.455937 -0.099121 -0.257644 -0.245332 -0.373478 -0.310540 -0.136040 -0.215960 0.221015 0.237868 0.219657 0.217030 0.224817 0.239921 0.213232 0.223075 0.236108 0.255107 0.282121 0.225976 0.230738 0.261739 0.268111 0.259018
chargesum: 0.00000
title: Mulliken charges with hydrogens summed into heavy atoms:
elementType: Cl N C C C C C C C C C C C C C C C C C C C
charge: -0.059610 -0.027982 0.129519 -0.172377 0.352405 0.431700 0.197790 -0.097178 -0.050349 -0.245681 -0.154937 -0.255316 -0.111389 0.455937 -0.099121 -0.031668 -0.014594 -0.111739 -0.042429 -0.136040 0.043058
polarizability: 4.04678229e+02 8.01839380e+00 2.22607973e+02 -5.43468850e+00 6.60907888e+00 1.06492013e+02
1716.lowfreq: -9.7718 -6.2088 -3.4409 0.0017 0.0020 0.0022 38.3869 51.9197 97.8826
frequency: 38.3438 51.8958 97.8822 106.5723 125.3022 137.7417 195.9476 200.3711 213.7238 253.9718 265.2333 269.9572 290.5976 304.1975 324.9923 343.8980 360.5459 373.8978 408.8781 431.9738 459.8072 473.9175 488.2268 508.9658 525.4838 551.3615 576.8288 588.1920 613.1230 641.4507 682.5867 699.9809 729.7365 747.3971 767.4669 770.6119 797.9308 809.4046 832.5016 846.4194 865.3286 890.0505 891.5107 924.5424 929.8772 937.6344 964.4775 969.2671 970.1298 1000.0508 1005.6375 1010.2810 1040.6078 1060.6465 1084.8414 1110.5589 1128.7287 1141.4918 1167.2255 1175.5990 1187.8549 1211.2949 1228.9975 1237.2977 1257.3272 1275.3808 1285.4611 1301.9157 1315.4622 1366.1477 1372.6949 1378.3847 1389.7779 1396.9552 1411.9728 1431.7805 1442.5317 1447.8678 1462.0377 1467.4300 1477.9499 1478.7621 1486.7711 1487.9643 1539.5581 1577.5151 1599.2697 1606.6485 1618.4911 2954.4803 2973.1081 2977.3987 3025.6387 3066.6932 3072.0131 3077.5725 3083.8950 3121.2321 3126.7851 3143.7694 3151.5992 3156.8427 3157.1423 3168.4158 3177.8588
redmass: 7.5989 3.7743 4.4595 5.1287 4.5747 3.7205 2.5865 3.8894 1.7099 1.0707 3.7711 4.1877 2.5095 3.7485 2.6790 4.7814 3.7301 3.4106 4.7962 5.0731 4.0655 3.1215 3.9300 4.3495 3.4200 3.4867 3.6601 4.7444 7.7550 7.2210 5.8172 4.1954 5.4615 5.1805 3.1548 1.4468 2.5119 4.3667 1.8414 2.4178 1.5371 3.0060 1.4838 1.7054 2.1129 1.4617 1.7667 1.3502 1.4391 1.3849 4.7987 1.3831 2.4617 2.1704 2.3387 1.7064 1.4094 1.9106 2.6104 1.0848 1.6400 2.1198 2.0779 2.5784 1.5028 2.0737 1.9212 2.4416 1.9310 5.0939 7.3480 1.2106 2.4682 1.3042 8.2537 2.9136 1.4496 1.7789 1.0571 1.1277 1.5408 3.4902 1.4231 1.1375 7.9196 6.9726 7.0664 6.6863 7.1399 1.0629 1.0353 1.0361 1.0968 1.0994 1.0985 1.1004 1.0998 1.0921 1.0854 1.0899 1.0927 1.0881 1.0942 1.0989 1.0979
irintensity: 0.0573 0.0178 0.1687 0.1838 0.4313 3.1221 0.9970 0.9308 0.2556 0.0464 0.6487 0.9990 0.4880 0.7612 0.0169 2.0654 1.4251 0.7036 7.5114 9.2458 4.3558 1.7728 7.5607 0.7556 0.1036 10.1304 5.7336 2.3985 2.1129 5.2624 12.4012 8.4403 5.5194 6.7945 2.0851 49.6223 16.1398 3.0921 43.4969 4.5229 1.9014 42.2876 4.1047 24.9374 15.8428 4.9906 5.0934 1.8299 1.2576 0.3581 15.6660 1.3335 9.5445 34.9796 6.2107 2.9643 6.3665 6.1345 1.2804 3.3688 3.7404 7.0379 4.5843 17.3162 6.8620 21.6200 4.6478 29.1167 7.6939 30.1556 2.4167 23.1021 23.4957 28.0534 20.7256 0.6658 2.1584 9.3513 2.6145 8.3869 5.9779 54.2891 55.3659 16.4498 24.0335 0.7114 43.8722 7.7459 4.9724 24.0490 24.0664 39.9690 22.3651 3.6590 60.6524 22.1336 40.0451 11.4466 0.4815 15.9427 4.5217 0.2388 24.8153 31.2910 5.7409
temp: 298.150 k
press: 1.00000 atm
elementType: 17 7 6 6 6 6 6 6 6 6 6 6 6 6 6 6 6 6 6 6 6 1 1 1 1 1 1 1 1 1 1 1 1 1 1 1 1
symmnumber: 1
zpe: 767714.0 jmol-1
zpe.correction: 0.292407 hartree
zpe.thermalcorrener: 0.309537 hartree
zpe.thermalcorrenthalpy: 0.310482 hartree
zpe.thermalcorrgfe: 0.248055 hartree
zpe.sumelectzpe: -1247.015438 hartree
zpe.sumelectthermal: -1246.998307 hartree
zpe.sumelectthermalent: -1246.997363 hartree
zpe.sumelectthermalfe: -1247.059790 hartree
dipole: 2.7340 -1.8015 -0.3019
dipole: 3.2881
quadrupole: -129.9982 -117.1394 -134.3934
quadrupole: -4.0379 0.0192 1.5470
quadrupole: -2.8212 10.0376 -7.2164 -4.0379 0.0192 1.5470
hfenergy: -1247.3078446 hartree
pointgroup: C01 [X(C19H16Cl1N1)]
dipole: -1.0753442 0.7079281 -0.1263332 debye
polarizability: 404.5649907|8.2235041|222.6325252|7.6919169|-6.4516245|106.5806994 unknown
InChI: InChI=1S/C19H16ClN/c1-19(2)11-13-9-12-10-14(20)7-8-17(12)21-18(13)15-5-3-4-6-16(15)19/h3-10H,11H2,1-2H3
charge 0 multiplicity 1
37 atoms
Cl 6.438713 0.527908 0.111441
N  0.667461 -1.2137 0.076478
C  -2.511533 1.651602 0.140494
C  -1.238704 1.994155 -0.690307
C  -2.8091 0.144763 -0.015725
C  -0.063218 1.091858 -0.382339
C  -1.727935 -0.788486 -0.107477
C  -3.671203 2.545722 -0.366121
C  -2.260637 1.955344 1.649254
C  -0.3215 -0.311545 -0.131625
C  -4.13167 -0.359305 0.007023
C  1.257015 1.5369 -0.376262
C  -1.995877 -2.181963 -0.163142
C  2.330654 0.615883 -0.147542
C  1.978781 -0.774394 0.065405
C  -4.391962 -1.746229 -0.057476
C  -3.317829 -2.663555 -0.13926
C  3.706109 1.007775 -0.130122
C  3.023051 -1.730431 0.282768
C  4.681062 0.03807 0.087558
C  4.363163 -1.336418 0.294788
H  -0.96239 3.05299 -0.523441
H  -1.493096 1.894246 -1.767155
H  -4.571477 2.450846 0.266652
H  -3.364133 3.607819 -0.336635
H  -3.95099 2.296989 -1.406348
H  -1.403794 1.380809 2.043379
H  -2.051283 3.032393 1.795033
H  -3.150298 1.691177 2.248684
H  -4.975313 0.334659 0.075618
H  1.482108 2.595319 -0.556672
H  -1.141059 -2.862369 -0.221777
H  -5.426457 -2.107858 -0.043433
H  -3.512924 -3.740429 -0.186575
H  3.981977 2.055208 -0.288743
H  2.736924 -2.774238 0.441821
H  5.164561 -2.061914 0.461181
