program: Gaussian 09
title: 000288805
version: EM64L-G09RevD.01
frameworkgroup: C1[X(C17H14Br2O)]
method: RPBEPBE
basis: SDD
operation: Freq
keyword: #p
keyword: freq=noraman
keyword: PBEPBE/SDD
title: #p freq=noraman PBEPBE/SDD
converged: NO YES NO NO
title: Mulliken charges:
elementType: Br Br O C C C C C C C C C C C C C C C C C H H H H H H H H H H H H H H
charge: 0.017420 -0.013015 -0.182035 -0.234613 -0.464529 -0.582806 -0.718458 0.167465 0.409661 0.140050 0.557834 -0.413799 -0.339318 -0.220636 -0.245835 -0.334454 -0.407618 -0.244509 -0.222772 -0.234283 0.247298 0.273624 0.232724 0.260279 0.371502 0.239988 0.281815 0.233899 0.250968 0.241470 0.238912 0.229354 0.231804 0.232615
chargesum: 0.00000
title: Mulliken charges with hydrogens summed into heavy atoms:
elementType: Br Br O C C C C C C C C C C C C C C C C C
charge: 0.017420 -0.013015 -0.182035 -0.234613 0.056393 -0.089803 -0.346956 0.167465 0.409661 0.140050 0.557834 -0.173812 -0.057503 0.013263 -0.006923 -0.083486 -0.166148 -0.015154 0.009032 -0.001668
polarizability: 2.90777218e+02 -3.10877813e+01 1.83645505e+02 -4.90471173e+00 -2.67817049e+00 1.87681932e+02
1716.lowfreq: -6.9589 -5.2057 -0.0007 -0.0003 -0.0001 3.9734 25.5610 30.2836 54.7929
frequency: 25.5088 30.2452 54.7702 66.4672 91.2530 104.8985 131.3135 145.8936 152.8803 173.5398 199.8235 227.0871 234.7486 245.1558 306.5680 310.3789 398.4656 404.9952 428.3529 444.7042 462.4483 486.2307 508.6995 540.3037 558.9691 607.2510 619.8115 627.2904 654.8519 689.1378 701.8098 704.2778 746.4346 770.2131 786.8643 802.6484 814.0833 849.1406 872.6752 892.5203 915.8404 926.8607 975.4090 978.6959 990.2899 997.3623 1006.5713 1008.8092 1020.9035 1028.2648 1037.5992 1073.6821 1084.9980 1118.4064 1139.0745 1172.0578 1175.0874 1178.0242 1180.5155 1192.6028 1212.8148 1228.0459 1237.8600 1246.4111 1287.8782 1305.9860 1328.9325 1347.2877 1366.5546 1385.6832 1390.3912 1439.4811 1443.5690 1450.4664 1453.8103 1478.5854 1482.5403 1567.4899 1585.4368 1590.5001 1610.0756 1615.5885 2973.9158 2991.4364 3044.7328 3071.3808 3088.6839 3124.4109 3126.8655 3132.1068 3140.7512 3144.5115 3153.8819 3155.0462 3168.2468 3169.5129
redmass: 6.8617 6.2402 7.0633 5.2661 4.6446 11.5530 8.8298 10.1637 6.5248 8.1795 7.2118 4.9896 3.0350 5.8202 2.4276 5.2621 3.5403 2.8909 5.2796 4.3189 4.0131 3.6329 4.8536 5.2757 5.5890 5.3741 3.8881 5.5020 4.9583 4.7753 1.6471 4.6118 1.8069 2.4410 2.0973 3.6342 2.9471 1.2618 2.4353 1.3797 3.7319 1.4709 1.4210 1.3980 5.7116 1.3307 1.3534 2.2869 2.6956 2.2370 2.1642 3.1894 1.6579 1.9217 2.0138 1.1597 1.0692 1.1773 1.2124 1.1135 1.9294 1.5485 2.3734 2.5483 1.5263 1.5579 1.6132 1.4469 1.6266 5.6950 6.3313 2.1447 2.2847 1.1244 1.1464 2.3145 2.2738 9.6857 7.2487 6.0562 6.0712 6.7766 1.0650 1.0623 1.0955 1.0980 1.0857 1.0870 1.0851 1.0881 1.0898 1.0923 1.0938 1.0961 1.1016 1.1001
irintensity: 0.7414 0.4925 0.1943 0.2625 0.3465 1.6224 1.7337 0.7887 0.5685 1.0504 1.5217 0.1906 2.5979 3.0284 2.6940 9.1294 6.7089 1.2579 3.2150 8.4818 23.2784 1.2046 26.9302 40.7636 39.8832 15.3349 29.4195 4.4126 4.5021 0.9876 59.5872 4.2562 48.1614 11.5434 7.1141 13.6431 39.1485 0.1024 21.3199 0.8680 21.3862 7.1090 0.9423 3.8812 0.3260 0.1504 0.0251 1.1640 15.1955 4.3684 1.7396 0.9616 10.7902 15.2532 8.1938 9.6122 6.8906 6.2793 4.6634 3.4068 5.9134 55.8450 47.4534 38.8277 50.0404 12.3747 2.6577 4.8217 13.0291 2.3518 3.8820 13.0605 19.8107 12.9095 22.7822 7.4690 5.0033 109.5250 60.4743 6.2978 0.5362 30.5847 10.6159 9.6404 18.9527 12.9003 4.6000 3.8737 2.2999 0.5932 12.3716 19.6915 11.1870 28.9226 20.1652 26.7119
temp: 298.150 k
press: 1.00000 atm
elementType: 35 35 8 6 6 6 6 6 6 6 6 6 6 6 6 6 6 6 6 6 1 1 1 1 1 1 1 1 1 1 1 1 1 1
symmnumber: 1
zpe: 679566.4 jmol-1
zpe.correction: 0.258833 hartree
zpe.thermalcorrener: 0.276568 hartree
zpe.thermalcorrenthalpy: 0.277512 hartree
zpe.thermalcorrgfe: 0.210765 hartree
zpe.sumelectzpe: -756.961590 hartree
zpe.sumelectthermal: -756.943855 hartree
zpe.sumelectthermalent: -756.942911 hartree
zpe.sumelectthermalfe: -757.009658 hartree
dipole: -0.9081 -1.5017 3.8697
dipole: 4.2490
quadrupole: -108.0018 -144.3577 -129.4152
quadrupole: -4.8108 -4.2719 -0.1129
quadrupole: 19.2564 -17.0995 -2.1570 -4.8108 -4.2719 -0.1129
hfenergy: -757.2204233 hartree
pointgroup: C01 [X(C17H14Br2O1)]
dipole: 0.3009752 1.6411212 0.1033892 debye
polarizability: 292.3869383|-5.0467545|188.5209828|28.1196404|1.0051246|181.1967338 unknown
InChI: InChI=1S/C17H14Br2O/c18-15(13-7-2-1-3-8-13)17(19)11-10-12-6-4-5-9-14(12)16(17)20/h1-9,15H,10-11H2
charge 0 multiplicity 1
34 atoms
Br -0.475894 0.155471 -2.296781
Br -0.874763 -1.361344 2.269964
O  1.088635 -2.229726 -0.454983
C  -0.088268 -0.096769 -0.241449
C  0.125356 1.302502 0.347536
C  1.398998 1.989421 -0.182338
C  -1.29358 -0.915501 0.273215
C  1.195114 -0.981352 -0.288033
C  2.62858 1.112237 -0.046156
C  2.511968 -0.307677 -0.122935
C  -2.682147 -0.332018 0.164081
C  3.914493 1.679017 0.120778
C  3.672804 -1.126326 -0.042288
C  5.062739 0.862461 0.202707
C  4.943047 -0.548073 0.118803
C  -3.111295 0.803241 0.900962
C  -3.600379 -0.960613 -0.717371
C  -4.416841 1.31156 0.738226
C  -4.906191 -0.449602 -0.884082
C  -5.317797 0.69154 -0.159289
H  0.20479 1.179004 1.446211
H  -0.759191 1.92839 0.141761
H  1.551158 2.946399 0.349303
H  1.249825 2.240326 -1.252285
H  -1.229025 -1.91652 -0.181269
H  4.015079 2.768909 0.185708
H  3.542554 -2.211356 -0.108269
H  6.049213 1.320992 0.334757
H  -2.442341 1.259987 1.637356
H  -3.28335 -1.843836 -1.283927
H  5.834234 -1.180963 0.182282
H  -4.736547 2.183366 1.319703
H  -5.599661 -0.944296 -1.572706
H  -6.33252 1.086048 -0.281991
