program: Gaussian 09
title: 000288843
version: EM64L-G09RevD.01
frameworkgroup: C1[X(C22H17N3O2)]
method: RPBEPBE
basis: SDD
operation: Freq
keyword: #p
keyword: freq=noraman
keyword: PBEPBE/SDD
title: #p freq=noraman PBEPBE/SDD
converged: YES YES NO NO
title: Mulliken charges:
elementType: O O N N N C C C C C C C C C C C C C C C C C C C C C C H H H H H H H H H H H H H H H H H
charge: -0.201755 -0.202961 -0.230910 0.023616 0.012515 -0.193425 -0.606477 -0.135302 0.316034 0.215889 0.326276 -0.548991 0.011207 -0.416713 -0.405031 0.351208 -0.333436 -0.352271 -0.226222 -0.226723 -0.254332 0.178349 -0.249998 -0.334551 -0.355093 -0.243015 -0.213543 0.257905 0.248955 0.236760 0.267172 0.286091 0.246003 0.273194 0.242585 0.256806 0.229282 0.232151 0.224960 0.229961 0.292617 0.285453 0.241848 0.243910
chargesum: 0.00000
title: Mulliken charges with hydrogens summed into heavy atoms:
elementType: O O N N N C C C C C C C C C C C C C C C C C C C C C C
charge: -0.201755 -0.202961 -0.230910 0.023616 0.012515 0.064480 -0.120763 -0.135302 0.316034 0.215889 0.326276 0.004272 0.011207 -0.170710 -0.131836 0.351208 -0.090851 -0.095466 0.003061 0.005428 -0.029372 0.178349 -0.020037 -0.041935 -0.069640 -0.001167 0.030368
polarizability: 3.64249815e+02 4.18848525e+01 3.13228109e+02 -1.68626790e+01 1.26454586e+01 1.89976467e+02
1716.lowfreq: -6.5067 -4.3743 -0.0009 -0.0008 -0.0006 0.2904 17.9122 23.4348 35.3924
frequency: 17.8250 23.4301 35.3871 56.5338 61.3076 74.4268 119.5049 129.5931 132.2170 168.5706 185.2031 204.3287 227.1089 277.3406 288.4171 310.0117 320.7035 340.0571 377.9287 381.9111 403.0833 424.6969 448.2999 469.9220 475.4875 476.3076 508.3612 518.6701 549.5018 564.2083 571.3035 574.6187 593.4655 627.6478 653.1943 660.5350 665.5358 677.8252 703.9279 716.7296 743.8394 746.5967 755.8429 763.2994 776.1726 790.0898 793.0544 809.2567 835.5702 849.9807 851.8295 884.0127 888.4808 910.3807 939.2452 955.8135 972.7764 974.6691 991.5632 996.2575 1004.6797 1012.9714 1016.2338 1031.0138 1040.2151 1041.8594 1060.0686 1072.3033 1089.8124 1115.6405 1133.0603 1153.5999 1166.2469 1168.1529 1170.4368 1184.5859 1185.0486 1193.6782 1197.8918 1211.3197 1223.6486 1251.4628 1256.0410 1258.7097 1287.2987 1291.4526 1305.4008 1313.5046 1329.2796 1356.2629 1368.7874 1379.7285 1392.9661 1395.9431 1434.2561 1435.8874 1449.5239 1452.7255 1457.5285 1469.1160 1470.2943 1473.6460 1561.3553 1576.9598 1582.9909 1595.8234 1609.7924 1617.8276 1630.4838 2861.6083 2968.2012 2977.1007 3056.8749 3066.0884 3125.6798 3131.5921 3138.1471 3142.8355 3147.1296 3153.5696 3158.9816 3160.1761 3167.8084 3171.1778 3171.9208 3186.0463
redmass: 6.8279 6.7918 4.8501 10.6935 5.0511 4.4245 4.5765 5.9696 4.4624 5.5446 4.9056 5.5716 3.3291 6.5305 5.4421 3.7852 3.8577 4.3897 7.6050 4.2756 3.6841 3.6648 3.4028 3.1278 4.0959 3.6841 3.3165 5.7724 5.8149 4.1487 5.7005 5.5798 5.9950 5.5194 5.4628 6.0130 5.1355 5.7248 2.9601 3.8253 3.0562 2.4576 1.3309 4.4616 2.3390 1.5090 3.6413 5.8591 3.5639 3.0728 1.8422 1.4000 1.5382 2.3336 1.3844 1.4612 1.3889 1.5648 1.6293 1.3378 1.9483 1.7139 2.5665 2.9867 2.4085 2.6170 3.3304 3.2580 2.1352 1.7627 2.0927 1.4571 1.2778 1.2186 1.2250 1.9501 1.5329 1.6952 2.5941 7.2896 1.3392 2.3141 1.5534 1.3062 1.6517 1.8511 1.6295 1.7506 1.9609 3.1966 2.7459 6.2816 4.0243 5.6379 2.2212 1.3551 2.1567 1.3759 2.5088 2.3216 2.4392 2.2733 6.0807 6.4656 7.5991 7.2837 6.6198 7.3012 8.6452 1.0811 1.0705 1.0645 1.0978 1.0890 1.0862 1.0854 1.0903 1.0869 1.0891 1.0948 1.0937 1.0910 1.0996 1.0958 1.1001 1.0975
irintensity: 0.1098 1.8211 1.1505 0.6071 0.7744 0.4068 0.4903 1.0147 0.6973 4.1760 2.7997 0.4801 1.6629 2.0336 0.3513 1.3681 3.3251 0.2469 1.5288 0.2359 5.0417 0.6925 20.8245 9.1383 1.1411 1.2160 5.4130 5.7628 7.3233 2.5838 7.4547 2.0124 0.1281 3.9727 5.9707 9.5725 3.2205 1.1573 15.8636 7.3576 26.3620 16.5077 61.0230 43.4484 21.6976 45.3626 20.5168 7.0068 2.9436 2.4462 0.3515 1.1006 2.9386 2.7394 4.2060 0.4554 0.6898 2.9159 4.4849 0.2209 5.7717 0.2215 15.1352 2.1697 5.8556 16.4863 13.3263 1.2184 8.0777 11.3382 1.6882 13.0829 5.8617 8.8079 22.2234 3.4729 25.3461 20.4710 2.1611 210.3798 9.4264 95.1714 11.4511 2.6123 4.8122 0.5271 28.4296 10.6073 22.0987 88.7663 55.8384 19.1424 42.2751 11.3440 16.5931 18.2260 14.7696 26.7380 6.6061 28.9821 73.7263 10.4988 7.7926 11.2124 4.3551 7.2719 11.5342 2.7824 57.9980 69.2197 29.9780 21.5046 16.3395 2.0059 1.3771 1.1134 12.6474 2.6323 8.8631 24.3823 31.0445 3.6468 30.2377 8.9578 27.9252 7.8649
temp: 298.150 k
press: 1.00000 atm
elementType: 8 8 7 7 7 6 6 6 6 6 6 6 6 6 6 6 6 6 6 6 6 6 6 6 6 6 6 1 1 1 1 1 1 1 1 1 1 1 1 1 1 1 1 1
symmnumber: 1
zpe: 888265.0 jmol-1
zpe.correction: 0.338322 hartree
zpe.thermalcorrener: 0.359074 hartree
zpe.thermalcorrenthalpy: 0.360018 hartree
zpe.thermalcorrgfe: 0.286931 hartree
zpe.sumelectzpe: -1161.307743 hartree
zpe.sumelectthermal: -1161.286991 hartree
zpe.sumelectthermalent: -1161.286047 hartree
zpe.sumelectthermalfe: -1161.359135 hartree
dipole: -1.3292 -1.5660 3.0806
dipole: 3.7026
quadrupole: -158.1435 -149.6317 -156.2797
quadrupole: 13.5602 15.6890 -4.8422
quadrupole: -3.4585 5.0532 -1.5947 13.5602 15.6890 -4.8422
hfenergy: -1161.6460653 hartree
pointgroup: C01 [X(C22H17N3O2)]
dipole: 0.5023855 -0.6061773 -1.2256228 debye
polarizability: 363.1780091|-42.1843081|314.0662119|-19.7355463|-10.5890271|190.2101696 unknown
InChI: InChI=1S/C22H17N3O2/c26-25(27)19-11-5-2-8-16(19)14-24-20-12-6-4-10-18(20)23-22-17-9-3-1-7-15(17)13-21(22)24/h1-12,21H,13-14H2
charge 0 multiplicity 1
44 atoms
O  -5.396011 -1.673457 1.307597
O  -3.313922 -1.593683 2.220944
N  -0.055324 0.383826 0.570149
N  2.358714 1.764992 -0.132969
N  -4.124076 -1.472609 1.216621
C  1.237727 -0.200878 0.997369
C  1.444324 -1.712603 0.685281
C  2.372695 0.501205 0.222422
C  2.90936 -1.788331 0.261349
C  3.414026 -0.492164 -0.046879
C  -0.079485 1.79246 0.422169
C  -1.28296 -0.334641 0.940903
C  1.15617 2.478489 0.120974
C  3.728054 -2.921833 0.10156
C  4.729771 -0.314565 -0.534604
C  -2.236577 -0.585435 -0.237305
C  -1.275206 2.555693 0.50008
C  1.16015 3.883888 -0.040208
C  5.052027 -2.747138 -0.372678
C  5.5470 -1.454529 -0.691589
C  -1.243059 3.958512 0.344413
C  -3.56118 -1.09867 -0.105016
C  -0.026238 4.633748 0.08605
C  -1.807025 -0.290166 -1.555241
C  -4.413317 -1.300162 -1.218274
C  -2.637094 -0.498866 -2.676068
C  -3.948858 -1.002863 -2.510781
H  1.403502 -0.033114 2.090194
H  0.78838 -2.011168 -0.157877
H  1.212472 -2.369181 1.541809
H  -1.822364 0.189172 1.756117
H  -1.005088 -1.307988 1.37715
H  3.353278 -3.924766 0.335506
H  5.094374 0.68972 -0.771753
H  -2.235907 2.065772 0.682491
H  2.116955 4.358144 -0.281108
H  5.703487 -3.619622 -0.496367
H  6.5738 -1.34525 -1.057668
H  -2.178074 4.524314 0.424419
H  -0.009906 5.721715 -0.032501
H  -0.79901 0.114452 -1.681334
H  -5.41968 -1.688922 -1.042722
H  -2.261414 -0.261647 -3.677058
H  -4.598692 -1.162952 -3.376669
