program: Gaussian 09
title: 000288801
version: EM64L-G09RevD.01
frameworkgroup: C1[X(C16H15BrO2)]
method: RPBEPBE
basis: SDD
operation: Freq
keyword: #p
keyword: freq=noraman
keyword: PBEPBE/SDD
title: #p freq=noraman PBEPBE/SDD
converged: YES YES NO NO
title: Mulliken charges:
elementType: Br O O C C C C C C C C C C C C C C C C H H H H H H H H H H H H H H H
charge: 0.021524 -0.238451 -0.194894 -0.100405 -0.676896 0.383068 0.226955 0.322002 -0.432401 -0.340851 -0.220147 -0.239421 -0.320518 -0.351119 -0.236304 -0.511362 -0.253585 -0.227807 -0.223735 0.207765 0.307748 0.229536 0.297698 0.226896 0.229778 0.245599 0.277064 0.229833 0.201633 0.238645 0.221686 0.231947 0.234198 0.234322
chargesum: 0.00000
title: Mulliken charges with hydrogens summed into heavy atoms:
elementType: Br O O C C C C C C C C C C C C C C C C
charge: 0.021524 -0.238451 -0.194894 0.107360 -0.369148 0.383068 0.226955 0.322002 -0.202865 -0.043153 0.006748 -0.009642 -0.074919 -0.074055 -0.006470 0.150602 -0.021638 0.006391 0.010587
polarizability: 2.11712009e+02 3.59770019e+00 1.97061612e+02 -8.09950630e+00 -1.13887988e+01 1.69519910e+02
1716.lowfreq: -0.7594 -0.0004 -0.0002 0.0005 3.6605 6.3842 18.9855 38.2661 42.7107
frequency: 18.8973 38.2549 42.7013 55.9714 77.6520 82.8620 97.0650 136.8420 148.5934 160.0545 177.4297 180.4587 218.1063 238.7884 273.7146 309.8341 399.3026 407.0557 412.4926 420.1460 454.8810 473.4698 554.0151 563.4675 613.9002 614.5902 618.1485 689.1712 692.3764 704.4754 714.7731 751.4821 766.8764 802.8392 843.6765 854.1042 860.2112 920.2628 929.7493 941.5993 947.4173 983.4964 988.5310 989.9017 991.2116 1003.7104 1010.6408 1023.3391 1027.7404 1034.1225 1079.2761 1089.2419 1108.1926 1115.0982 1137.7238 1154.5969 1172.2028 1174.2888 1183.9255 1189.8110 1194.5942 1222.9753 1271.0878 1307.8016 1319.8346 1339.1927 1362.9772 1386.8844 1387.8512 1432.1897 1436.0677 1442.9131 1458.2233 1474.4590 1477.7381 1479.3963 1567.9258 1592.4900 1596.6140 1608.5117 1611.7120 2909.9146 2935.9635 3018.9693 3071.6295 3106.7271 3112.2786 3127.1989 3130.2167 3140.5524 3140.9109 3151.7474 3157.9634 3161.1692 3170.1703 3170.9810
redmass: 5.7968 4.3598 4.2014 5.2500 2.9375 6.3429 6.3039 6.1348 4.4738 3.1911 3.1145 2.8542 5.2587 2.8336 3.9005 7.0812 2.7983 2.8867 4.5138 4.0370 7.0642 4.3532 4.1400 6.3323 6.4251 6.4485 6.1788 5.5106 2.1439 2.0693 1.8705 5.4070 1.9263 2.5836 4.2531 1.2575 1.2493 2.7290 2.3805 1.7240 2.2828 1.4585 2.3261 4.5848 2.2102 1.3446 1.3450 2.8768 2.1348 3.2210 1.6264 1.5977 2.2108 1.2698 1.4347 1.3982 1.0660 1.0657 1.5749 1.5259 1.1776 2.7672 1.5036 1.5353 1.3080 1.3008 1.3573 5.5928 8.8835 1.3135 2.2684 1.7251 1.0538 1.0586 2.1980 2.1823 7.5440 6.0808 6.6987 5.9710 6.5092 1.0823 1.0350 1.1013 1.0849 1.0883 1.0982 1.0866 1.0852 1.0881 1.0924 1.0925 1.0972 1.0959 1.0979 1.1011
irintensity: 0.9142 1.2535 0.3763 0.4249 2.7001 0.1537 2.3794 1.7262 0.9772 0.2512 0.7027 1.5011 0.0655 7.7396 4.9263 2.7369 0.1408 0.0566 2.4583 4.1091 0.2153 12.9335 83.5560 39.4814 0.3747 1.5275 0.6647 1.7023 41.3157 33.4449 65.1282 15.6718 24.0018 34.9744 4.4582 0.6721 1.1854 5.4864 13.8384 24.9954 43.5792 1.1816 1.6702 0.5936 1.4415 2.5935 0.4896 14.5884 1.3361 52.6019 10.9782 15.2759 53.5191 0.3501 4.0953 2.0722 0.4355 3.8599 9.0717 4.2348 13.2284 183.3200 3.2846 28.9577 8.2313 22.0699 7.8494 1.0943 2.4948 7.2660 19.4923 13.9152 8.6795 9.3130 13.1911 1.5725 109.0542 2.0515 44.0658 1.0845 7.9441 29.0770 83.8348 48.7774 4.9167 8.9100 23.4724 0.9884 0.1677 6.8046 27.4564 19.2958 23.9552 18.4046 13.1153 19.6078
temp: 298.150 k
press: 1.00000 atm
elementType: 35 8 8 6 6 6 6 6 6 6 6 6 6 6 6 6 6 6 6 1 1 1 1 1 1 1 1 1 1 1 1 1 1 1
symmnumber: 1
zpe: 694687.0 jmol-1
zpe.correction: 0.264592 hartree
zpe.thermalcorrener: 0.282489 hartree
zpe.thermalcorrenthalpy: 0.283433 hartree
zpe.thermalcorrgfe: 0.215777 hartree
zpe.sumelectzpe: -781.221060 hartree
zpe.sumelectthermal: -781.203164 hartree
zpe.sumelectthermalent: -781.202219 hartree
zpe.sumelectthermalfe: -781.269875 hartree
dipole: -0.3496 -2.1549 -2.9799
dipole: 3.6940
quadrupole: -101.9153 -117.3223 -116.0724
quadrupole: -7.0796 -0.6700 -2.8332
quadrupole: 9.8547 -5.5523 -4.3024 -7.0796 -0.6700 -2.8332
hfenergy: -781.4856522 hartree
pointgroup: C01 [X(C16H15Br1O2)]
dipole: 0.0772266 1.2773324 -0.6889305 debye
polarizability: 208.9500126|0.593688|183.4770411|10.2014675|19.1001225|185.8664769 unknown
InChI: InChI=1S/C16H15BrO2/c1-19-16(13-10-6-3-7-11-13)14(17)15(18)12-8-4-2-5-9-12/h2-11,14,16H,1H3
charge 0 multiplicity 1
34 atoms
Br -0.461006 -2.596678 -1.835004
O  1.919888 -2.070071 0.28844
O  -0.486376 -0.906281 1.484426
C  1.64458 -0.946627 -0.594505
C  0.129726 -0.873128 -0.881521
C  2.16392 0.397109 -0.056103
C  -0.840732 -0.660184 0.298501
C  -2.212512 -0.113006 0.005196
C  2.68007 1.361194 -0.957434
C  2.144663 0.681669 1.33245
C  3.15928 2.603318 -0.482828
C  2.633154 1.918567 1.806705
C  -2.678467 0.197883 -1.301855
C  -3.071925 0.117248 1.115243
C  3.136664 2.884313 0.902752
C  3.336199 -2.446167 0.288869
C  -3.971266 0.730429 -1.48972
C  -4.361761 0.648788 0.926731
C  -4.815439 0.959361 -0.37825
H  2.128485 -1.126417 -1.583785
H  -0.028082 -0.100097 -1.65138
H  2.718948 1.137881 -2.032071
H  1.7414 -0.071801 2.016229
H  3.556553 3.342325 -1.18768
H  2.617526 2.131646 2.881477
H  -2.054637 0.006948 -2.180761
H  -2.698294 -0.129531 2.114435
H  3.512554 3.844163 1.274782
H  3.678266 -2.719106 -0.732284
H  3.408307 -3.324499 0.948305
H  3.976866 -1.631731 0.682891
H  -4.322656 0.962106 -2.500924
H  -5.01377 0.82191 1.789659
H  -5.818921 1.373264 -0.527989
