program: Gaussian 09
title: 000288789
version: EM64L-G09RevD.01
frameworkgroup: C1[X(C19H22O2)]
method: RPBEPBE
basis: SDD
operation: Freq
keyword: #pfreq=noraman
keyword: PBEPBE/SDD
title: #p freq=noraman PBEPBE/SDD
converged: YES YES NO NO
title: Mulliken charges:
elementType: O O C C C C C C C C C C C C C C C C C C C H H H H H H H H H H H H H H H H H H H H H H
charge: -0.471561 -0.464986 0.157474 0.319300 -0.560594 -0.364246 0.337320 0.260041 -0.641387 -0.746968 -0.742126 -0.404439 -0.361893 0.498284 -0.273481 -0.254310 -0.383812 -0.451216 -0.234800 -0.230500 -0.246138 0.247767 0.210715 0.223408 0.209590 0.201796 0.217658 0.213918 0.218800 0.204864 0.205371 0.279513 0.232491 0.355954 0.263761 0.352245 0.224838 0.226997 0.270893 0.226256 0.224126 0.222807 0.226271
chargesum: 0.00000
title: Mulliken charges with hydrogens summed into heavy atoms:
elementType: O O C C C C C C C C C C C C C C C C C C C
charge: -0.115607 -0.112741 0.157474 0.319300 -0.102112 -0.140838 0.337320 0.260041 -0.230001 -0.096593 -0.052379 -0.171948 -0.098132 0.498284 -0.048643 -0.027313 -0.112919 -0.224960 -0.010674 -0.007693 -0.019867
polarizability: 2.64471746e+02 -2.20982082e+01 1.85189826e+02 5.05961165e+00 5.64284071e+00 1.57890005e+02
1716.lowfreq: -9.1008 -0.0002 0.0007 0.0007 1.1460 12.3974 26.2544 33.4053 43.1352
frequency: 26.1881 33.3571 43.1217 77.9990 92.1794 142.3357 158.7418 166.7431 205.4498 216.5458 249.4725 260.3681 263.4924 279.5434 292.5941 307.6941 311.5939 316.2413 336.7518 341.3561 372.6790 403.6113 431.8118 451.4603 467.9573 492.1511 529.0084 536.8942 554.9147 558.6494 614.3861 623.7837 624.2602 660.9356 703.5962 705.8860 743.4038 765.2845 770.5087 789.1012 807.8720 839.8996 854.2209 859.9616 873.2215 884.4650 906.2742 920.9372 929.9502 949.9508 959.6748 970.1847 975.2093 989.6581 989.8008 994.9047 1007.3952 1025.9462 1030.8597 1038.2366 1056.4907 1079.2910 1081.6808 1104.8492 1129.0456 1142.4918 1159.5374 1170.7894 1175.2676 1188.6489 1193.4327 1207.8426 1216.9765 1219.9174 1245.1760 1258.0267 1284.0006 1289.8733 1312.2336 1332.6475 1335.2911 1350.4907 1371.7776 1375.3322 1379.0695 1384.7190 1397.0585 1435.7007 1439.0003 1447.6314 1456.7770 1463.9841 1469.1161 1478.4906 1481.3287 1482.5560 1493.2039 1585.8207 1590.7325 1612.3816 1613.3409 2944.4242 2955.1984 2968.1712 2971.8766 2977.4739 3013.3255 3050.2221 3063.3357 3068.5785 3076.8186 3110.7073 3110.7851 3121.6464 3124.3552 3135.4472 3137.8727 3150.5027 3154.4007 3165.8398 3166.0133 3442.7604 3560.9946
redmass: 3.7828 4.5928 4.8606 4.1126 3.5671 3.2455 5.0967 2.8042 4.9693 1.2117 3.6628 1.1459 4.0252 2.8640 1.8187 3.2562 1.7207 3.6978 2.3823 3.0643 2.3696 2.8192 3.4975 2.7777 3.5478 3.6013 3.3585 3.0504 3.1513 1.2817 5.4699 4.2240 4.8801 4.4805 2.1468 2.4784 2.6037 2.6310 1.5282 3.8602 3.7197 2.7204 1.2524 2.7424 2.1785 1.4909 2.0972 1.6126 1.5522 2.6403 1.4915 2.3711 1.4149 3.0783 1.4353 1.4986 1.6767 2.1650 2.1216 2.5580 2.1743 1.8298 2.0954 1.9432 1.7025 1.5170 1.7805 1.0600 1.0660 1.1209 1.7666 1.8408 1.7402 1.7870 1.8835 1.5866 1.4365 1.8411 1.5347 1.4325 1.3372 1.6965 1.7345 1.9150 3.7912 2.8860 1.2203 2.2131 1.9310 1.1142 1.1489 1.0642 1.1230 1.8497 1.0694 2.2569 1.1875 7.2762 6.0117 6.2957 6.1225 1.0822 1.0600 1.0616 1.0379 1.0382 1.0993 1.0953 1.0995 1.0987 1.0991 1.0874 1.0987 1.0848 1.0866 1.0895 1.0927 1.0945 1.0963 1.0989 1.0994 1.0645 1.0661
irintensity: 0.0404 0.0621 0.4050 2.8416 0.0971 2.5066 0.9552 1.3564 0.5106 0.1148 1.1424 0.2653 1.6386 20.8577 43.3279 1.9536 44.3549 6.2762 2.7700 2.1468 1.0669 0.1065 7.5645 2.0945 9.3375 13.6971 10.8364 6.7042 7.3764 181.5423 3.7994 33.6147 1.9474 5.8794 46.8520 22.5332 19.1538 22.3171 58.3564 21.4845 12.3795 6.7302 0.3180 9.5594 8.8336 0.8517 5.2779 1.5770 2.6510 54.0561 3.3839 11.6446 0.7325 0.2053 0.1522 1.0148 21.1531 4.7982 31.8631 5.7842 4.0903 1.6580 11.0102 25.1687 5.5705 62.0952 16.6072 0.2291 0.8734 1.1027 6.9542 4.4897 15.7622 4.8097 27.5054 12.7973 2.1622 11.9493 5.1173 24.6348 6.8455 10.6555 3.9351 21.9154 12.8751 21.7866 11.7011 9.4521 5.1956 3.0340 5.7142 3.7701 1.6649 12.6405 15.2172 20.6009 30.5728 3.6773 1.3980 1.4840 12.4754 18.2402 39.8866 24.5723 35.3636 38.1396 25.0853 8.9355 7.0984 77.6148 40.9882 10.5099 5.4873 1.5870 1.0590 17.3885 32.0857 28.3860 27.3527 36.2416 6.1296 34.7622 6.8873
temp: 298.150 k
press: 1.00000 atm
elementType: 8 8 6 6 6 6 6 6 6 6 6 6 6 6 6 6 6 6 6 6 6 1 1 1 1 1 1 1 1 1 1 1 1 1 1 1 1 1 1 1 1 1 1
symmnumber: 1
zpe: 943216.3 jmol-1
zpe.correction: 0.359252 hartree
zpe.thermalcorrener: 0.378506 hartree
zpe.thermalcorrenthalpy: 0.379450 hartree
zpe.thermalcorrgfe: 0.312097 hartree
zpe.sumelectzpe: -886.129484 hartree
zpe.sumelectthermal: -886.110230 hartree
zpe.sumelectthermalent: -886.109285 hartree
zpe.sumelectthermalfe: -886.176639 hartree
dipole: -0.4968 -0.8950 -2.0850
dipole: 2.3227
quadrupole: -122.4668 -117.2366 -123.9899
quadrupole: -0.3070 0.6782 3.0453
quadrupole: -1.2357 3.9946 -2.7588 -0.3070 0.6782 3.0453
hfenergy: -886.4887358 hartree
pointgroup: C01 [X(C19H22O2)]
dipole: -0.1748624 0.2165943 0.8704094 debye
polarizability: 263.8276201|23.7210817|183.2474859|-4.3511312|8.9659883|160.4764711 unknown
InChI: InChI=1S/C19H22O2/c1-18(2)13-19(21,12-14-8-4-3-5-9-14)17(20)15-10-6-7-11-16(15)18/h3-11,17,20-21H,12-13H2,1-2H3
charge 0 multiplicity 1
43 atoms
O  -0.264311 0.909626 -1.319849
O  1.05347 2.766804 0.218967
C  1.092168 -1.565991 -0.16549
C  -0.258985 0.666762 0.135958
C  -0.165119 -0.842896 0.402464
C  1.000531 1.364199 0.724224
C  2.351784 -0.68191 -0.060482
C  2.304352 0.68794 0.322536
C  -1.548947 1.28544 0.774382
C  1.277981 -2.874692 0.66029
C  0.854987 -1.946843 -1.659744
C  3.618598 -1.237949 -0.383399
C  3.496455 1.45438 0.374808
C  -2.855659 0.580363 0.436037
C  4.803032 -0.477317 -0.325548
C  4.743509 0.883273 0.055232
C  -3.322036 0.492754 -0.903266
C  -3.645032 0.006441 1.465512
C  -4.543932 -0.15104 -1.198488
C  -4.870006 -0.636536 1.172827
C  -5.325117 -0.716307 -0.162762
H  -1.070349 -1.335816 0.00554
H  -0.191336 -0.976391 1.504627
H  0.911383 1.386682 1.832552
H  -1.607644 2.342275 0.438995
H  -1.422623 1.298448 1.875947
H  1.538523 -2.65276 1.711952
H  2.073077 -3.515912 0.239862
H  0.339138 -3.460253 0.65132
H  -0.008337 -2.634625 -1.74096
H  1.739341 -2.456887 -2.083464
H  0.6385 -1.044443 -2.252447
H  3.679155 -2.288742 -0.688269
H  0.129025 1.819298 -1.439533
H  3.424596 2.512066 0.645719
H  0.421985 3.322444 0.742561
H  5.763656 -0.939793 -0.579225
H  5.655248 1.489282 0.097891
H  -2.705501 0.911131 -1.70497
H  -3.299617 0.065212 2.505756
H  -4.887964 -0.21153 -2.237519
H  -5.466188 -1.071142 1.983439
H  -6.275192 -1.21135 -0.393782
