program: Gaussian 09
title: 000288777
version: EM64L-G09RevD.01
frameworkgroup: C1[X(C18H17BrO)]
method: RPBEPBE
basis: SDD
operation: Freq
keyword: #p
keyword: freq=noraman
keyword: PBEPBE/SDD
title: #p freq=noraman PBEPBE/SDD
converged: YES YES NO NO
title: Mulliken charges:
elementType: Br O C C C C C C C C C C C C C C C C C C H H H H H H H H H H H H H H H H H
charge: 0.009401 -0.146287 0.215947 -0.416476 0.326605 0.075637 -0.614287 0.200222 -0.725218 -0.752415 -0.413562 0.544590 -0.398662 -0.222645 -0.226344 -0.399419 -0.393094 -0.232337 -0.236122 -0.238493 0.265916 0.233725 0.218634 0.249977 0.250831 0.214460 0.240695 0.234614 0.248443 0.276857 0.232501 0.237195 0.238714 0.227261 0.223720 0.222961 0.226456
chargesum: 0.00000
title: Mulliken charges with hydrogens summed into heavy atoms:
elementType: Br O C C C C C C C C C C C C C C C C C C
charge: 0.009401 -0.146287 0.215947 -0.416476 0.326605 0.075637 -0.114647 0.200222 -0.005776 -0.062646 -0.165119 0.544590 -0.121805 0.009856 0.010851 -0.160706 -0.165833 -0.008617 -0.013161 -0.012037
polarizability: 2.57558756e+02 -2.15815041e+01 2.17091317e+02 -2.67288162e+01 -1.77795222e+01 1.42586772e+02
1716.lowfreq: -8.5608 -0.0007 -0.0003 0.0005 4.0316 9.9591 22.9492 45.0767 63.0671
frequency: 22.3920 45.0480 63.0383 81.8828 111.9351 115.6054 139.4845 176.9838 190.4820 195.7717 218.7436 231.0410 253.4611 269.7580 304.8433 310.0038 324.4679 366.2433 375.8958 405.5198 410.8151 433.8744 507.9703 519.3037 532.6209 557.4359 572.5563 603.0957 617.7729 644.2473 690.8287 704.6415 723.3618 756.8487 772.9748 773.2738 794.0018 810.4037 852.0034 889.1640 896.9403 911.3356 922.8406 946.9701 955.7178 966.2010 975.8458 978.9330 991.0989 994.6125 1001.8576 1003.4128 1015.4270 1028.1683 1037.6381 1076.6277 1089.6753 1113.7634 1162.1094 1171.1951 1172.4613 1176.9909 1190.7941 1203.3157 1220.9076 1226.4928 1264.3904 1282.0351 1313.8406 1332.9593 1384.6843 1385.7069 1394.1590 1403.4569 1441.4049 1448.7663 1451.3670 1455.7481 1468.1896 1468.9547 1484.9343 1486.2502 1491.6849 1592.2828 1594.6641 1607.8586 1615.9610 1647.7158 2979.5805 2984.3543 2987.0732 3056.5573 3072.4639 3084.2393 3091.0005 3099.6874 3113.3523 3123.8534 3129.3002 3135.7647 3141.6080 3147.1490 3151.7832 3163.1872 3166.7818
redmass: 5.3138 4.4437 5.4205 5.3530 6.5530 3.8188 5.8726 5.3402 5.4544 4.1150 3.8715 5.0767 1.4165 2.0203 1.5527 2.0115 3.3123 2.8555 2.1675 2.8255 3.6625 3.4745 4.0241 4.4105 4.8336 3.7189 4.4420 4.2328 6.2355 5.4122 3.9937 1.7258 4.2981 2.1264 1.9188 3.1851 2.3601 4.1638 1.2473 1.7277 1.8196 2.9621 1.8600 1.7972 2.3193 1.5186 1.3972 2.3738 3.9844 1.4871 1.3746 1.6193 2.2442 2.1946 2.4305 2.4439 1.6557 1.7899 3.2612 1.1888 1.0947 1.6272 1.1278 2.0459 2.4051 1.8218 3.1683 1.5657 1.3897 1.2602 1.2250 6.9654 5.9794 1.2295 2.1631 2.2542 1.2846 1.7910 1.0732 1.0937 1.9724 1.1349 1.0748 7.2691 6.0198 7.0301 6.1419 12.4794 1.0622 1.0360 1.0358 1.0977 1.0989 1.0996 1.1000 1.1002 1.0874 1.0858 1.0858 1.0913 1.0894 1.0961 1.0951 1.1016 1.1003
irintensity: 0.1848 0.5128 1.2380 0.3941 0.0918 1.3944 0.6931 0.3156 0.0425 0.6305 0.9899 0.6097 0.1261 0.5255 1.1886 1.8545 0.9447 0.5408 0.6347 0.0131 0.8311 2.5774 22.6494 2.7603 9.0269 1.1678 8.5314 7.6098 0.0332 28.8955 8.7627 45.2251 4.3823 42.9177 53.9108 4.3988 18.4761 8.1286 0.9549 7.2123 19.8399 27.3752 6.4826 7.3150 17.0780 1.4397 0.1425 5.3338 0.3768 0.2758 0.7482 5.4983 3.6117 7.1658 2.2745 20.7091 8.8858 1.1887 3.1862 11.0400 2.5371 1.5978 0.7956 45.6221 0.1737 13.3821 16.1604 13.0890 9.0169 0.1849 24.6128 0.4005 8.2017 21.8594 8.3592 11.7484 8.6355 6.2344 5.0549 4.5977 22.9300 5.9351 16.3289 5.3614 1.3272 63.7694 2.1999 133.2380 16.1412 20.6499 24.2085 8.1767 17.4987 29.8388 20.6239 22.8235 12.6878 0.1533 0.9529 20.4010 5.8584 38.2124 15.3163 23.3491 29.2026
temp: 298.150 k
press: 1.00000 atm
elementType: 35 8 6 6 6 6 6 6 6 6 6 6 6 6 6 6 6 6 6 6 1 1 1 1 1 1 1 1 1 1 1 1 1 1 1 1 1
symmnumber: 1
zpe: 774258.3 jmol-1
zpe.correction: 0.294899 hartree
zpe.thermalcorrener: 0.312909 hartree
zpe.thermalcorrenthalpy: 0.313853 hartree
zpe.thermalcorrgfe: 0.248268 hartree
zpe.sumelectzpe: -783.384531 hartree
zpe.sumelectthermal: -783.366522 hartree
zpe.sumelectthermalent: -783.365578 hartree
zpe.sumelectthermalfe: -783.431163 hartree
dipole: -3.7771 1.0620 3.4810
dipole: 5.2451
quadrupole: -110.0543 -118.2003 -133.3677
quadrupole: -3.2600 -1.8425 -5.0665
quadrupole: 10.4864 2.3405 -12.8269 -3.2600 -1.8425 -5.0665
hfenergy: -783.6794308 hartree
pointgroup: C01 [X(C18H17Br1O1)]
dipole: 1.4266964 -0.0750914 1.4890589 debye
polarizability: 253.7836348|-14.3534143|221.9094424|36.0152336|-6.9977704|141.5437675 unknown
InChI: InChI=1S/C18H17BrO/c1-17(2)15-11-7-6-10-14(15)16(20)18(17,19)12-13-8-4-3-5-9-13/h3-11H,12H2,1-2H3
charge 0 multiplicity 1
37 atoms
Br -0.878032 2.473166 -1.591887
O  -0.347666 -0.7129 -2.047748
C  1.528298 1.637483 0.051317
C  0.07838 1.146592 -0.389328
C  2.226212 0.276519 0.234676
C  0.349974 -0.190804 -1.148284
C  -0.841272 0.873821 0.854773
C  1.590532 -0.734179 -0.53155
C  2.269226 2.374478 -1.106918
C  1.549703 2.538882 1.304611
C  3.402252 -0.02341 0.949631
C  -2.152057 0.139811 0.610933
C  2.114022 -2.041795 -0.624792
C  3.926908 -1.337389 0.874379
C  3.29461 -2.339086 0.089643
C  -3.35869 0.85518 0.402571
C  -2.201016 -1.277755 0.63672
C  -4.579854 0.172329 0.209369
C  -3.419598 -1.964844 0.4462
C  -4.614498 -1.240976 0.229611
H  -1.039494 1.852659 1.326305
H  -0.225039 0.287791 1.565922
H  3.339132 2.478902 -0.849857
H  2.195104 1.818477 -2.057772
H  1.844636 3.38024 -1.263661
H  2.57987 2.888849 1.500208
H  0.92319 3.434184 1.139284
H  1.192089 2.023046 2.211515
H  3.910573 0.739028 1.549866
H  1.602815 -2.794633 -1.234167
H  4.840912 -1.586363 1.425679
H  3.72766 -3.344165 0.04528
H  -3.33741 1.950794 0.383203
H  -1.27966 -1.848842 0.808844
H  -5.502007 0.741209 0.045403
H  -3.437205 -3.060314 0.46627
H  -5.5615 -1.771887 0.080348
