program: Gaussian 09
title: 000288786
version: EM64L-G09RevD.01
frameworkgroup: C1[X(C19H18O2)]
method: RPBEPBE
basis: SDD
operation: Freq
keyword: #pfreq=noraman
keyword: PBEPBE/SDD
title: #p freq=noraman PBEPBE/SDD
converged: YES YES NO NO
title: Mulliken charges:
elementType: O O C C C C C C C C C C C C C C C C C C C H H H H H H H H H H H H H H H H H H
charge: -0.418633 -0.209514 0.125742 -0.572451 0.361898 -0.744871 -0.782165 0.152116 0.075861 -0.042047 0.081627 -0.394232 -0.342751 0.232627 -0.260770 -0.256927 -0.341305 -0.408744 -0.233472 -0.222956 -0.237182 0.237861 0.242673 0.217588 0.227888 0.244374 0.218881 0.228417 0.232584 0.252884 0.282520 0.230050 0.234803 0.253940 0.267963 0.376618 0.228408 0.229803 0.230894
chargesum: 0.00000
title: Mulliken charges with hydrogens summed into heavy atoms:
elementType: O O C C C C C C C C C C C C C C C C C C C
charge: -0.042015 -0.209514 0.125742 -0.091917 0.361898 -0.055021 -0.102282 0.152116 0.075861 -0.042047 0.081627 -0.141348 -0.060231 0.232627 -0.030720 -0.022124 -0.087366 -0.140782 -0.005064 0.006847 -0.006287
polarizability: 3.15417013e+02 1.99302246e+01 2.00481086e+02 -2.08456604e-01 -6.13250319e+00 1.43902257e+02
1716.lowfreq: -11.2020 -6.4757 -0.0004 0.0003 0.0005 2.3572 32.2233 36.7418 62.6571
frequency: 32.0503 36.6488 62.6559 74.6394 103.6621 120.3570 154.8433 173.5015 209.3600 216.7311 242.5103 260.0848 298.4862 310.8257 326.3193 341.6938 362.1741 369.4126 387.6960 401.3684 427.1122 458.6144 468.5139 494.6856 507.5548 545.9077 568.1889 588.7833 600.4398 615.2510 620.0003 641.4585 670.1572 702.4779 708.4909 740.9879 756.3966 770.9951 783.7707 827.6343 849.0182 857.3991 888.9504 914.2427 925.8931 936.5176 952.4366 968.8129 980.9077 987.7935 992.0507 996.7761 998.2875 1009.0380 1029.0921 1048.1239 1055.2248 1080.4441 1095.2247 1113.8268 1152.8590 1160.7778 1173.6105 1181.6009 1190.0872 1195.1239 1204.1325 1216.5910 1273.5187 1287.5093 1307.0074 1316.4923 1319.6579 1353.8491 1370.7073 1373.4651 1379.6744 1397.8579 1424.0278 1430.8642 1439.8072 1464.8950 1468.3559 1479.3256 1481.0381 1491.5279 1496.1622 1534.1922 1557.8051 1578.1892 1582.6110 1605.0157 1607.8002 2975.1277 2977.4738 2984.6157 3058.1141 3072.2483 3075.9491 3079.4581 3097.2076 3121.2722 3131.5496 3131.9323 3144.3244 3153.7036 3159.5566 3172.9282 3178.9455 3188.1072 3417.9149
redmass: 4.7341 5.1485 4.8290 5.1023 3.5871 3.6457 4.7600 3.7247 2.6437 1.4144 3.3322 3.3236 3.0912 3.5684 2.3856 1.9118 2.2300 2.8961 4.1558 2.8671 5.3627 3.6082 5.5409 3.1798 4.0583 3.4817 3.6228 1.5883 2.4728 5.4889 4.2655 5.6190 5.5072 2.0374 4.2161 4.5939 1.7862 1.7055 2.4173 3.9073 3.1693 1.2507 1.4637 2.1281 1.4934 1.4689 2.5058 1.4186 1.3858 4.8323 2.8320 1.3232 1.3454 1.3890 2.2384 3.9409 3.1245 1.6358 2.1670 1.9982 1.8009 2.5942 1.0535 1.2400 1.1992 1.4432 2.8073 2.4928 1.7432 1.8798 1.6632 1.8579 1.4682 4.4448 6.0656 5.4121 1.2362 1.1978 2.0141 2.2687 1.0840 1.1428 1.0537 2.2184 1.8681 1.1367 1.0805 8.3475 7.1784 6.0452 6.5161 5.9017 6.0678 1.0478 1.0500 1.0371 1.0970 1.1001 1.1000 1.0989 1.0984 1.0864 1.0876 1.0865 1.0930 1.0937 1.0972 1.0991 1.0925 1.0953 1.0641
irintensity: 0.9808 1.2283 0.2447 1.4626 0.5769 2.4031 0.1444 0.6210 2.2468 0.9106 1.1002 1.2672 0.3589 1.2657 2.4420 1.6965 1.9431 0.7988 0.8510 0.3304 2.5029 10.8413 6.3289 2.3212 7.2535 6.6388 13.2416 55.3707 24.8053 1.8225 13.6623 7.1089 11.3166 35.3587 4.3564 2.8739 35.9357 48.0050 23.7796 8.0942 5.6352 1.8592 0.3747 7.0408 0.7608 0.3857 3.7848 1.9043 1.2721 1.0551 2.3712 0.0195 0.3259 1.8804 9.5677 75.9323 10.8561 8.6549 26.3980 1.3930 3.1559 7.1920 0.0289 20.2779 12.1792 49.6988 5.8278 0.6469 16.5824 18.0466 14.1683 72.3561 4.5192 56.3431 2.6070 12.2979 27.6710 15.6310 9.6340 10.1333 8.7686 4.5963 9.4594 33.2721 15.8969 12.7581 3.7331 205.3604 134.5296 9.5941 41.4895 18.5926 3.2824 14.6631 26.5633 23.9502 7.8635 5.4754 26.2587 47.6537 26.3935 3.9873 1.1822 3.2705 23.2452 25.6619 34.1283 11.6471 15.9855 10.5138 132.2396
temp: 298.150 k
press: 1.00000 atm
elementType: 8 8 6 6 6 6 6 6 6 6 6 6 6 6 6 6 6 6 6 6 6 1 1 1 1 1 1 1 1 1 1 1 1 1 1 1 1 1 1
symmnumber: 1
zpe: 827092.5 jmol-1
zpe.correction: 0.315023 hartree
zpe.thermalcorrener: 0.333079 hartree
zpe.thermalcorrenthalpy: 0.334023 hartree
zpe.thermalcorrgfe: 0.269185 hartree
zpe.sumelectzpe: -883.775998 hartree
zpe.sumelectthermal: -883.757942 hartree
zpe.sumelectthermalent: -883.756998 hartree
zpe.sumelectthermalfe: -883.821835 hartree
dipole: -1.6059 -2.0180 0.6215
dipole: 2.6528
quadrupole: -103.8654 -128.4404 -121.0138
quadrupole: -9.4037 1.5885 2.6854
quadrupole: 13.9078 -10.6672 -3.2406 -9.4037 1.5885 2.6854
hfenergy: -884.0910205 hartree
pointgroup: C01 [X(C19H18O2)]
dipole: 0.6629271 0.674474 0.4415205 debye
polarizability: 316.9304995|12.2803588|192.4441567|8.6300043|18.7081933|150.4257006 unknown
InChI: InChI=1S/C19H18O2/c1-19(2)12-16(20)17(13-8-4-3-5-9-13)18(21)14-10-6-7-11-15(14)19/h3-11,21H,12H2,1-2H3
charge 0 multiplicity 1
39 atoms
O  -0.46272 1.996564 0.760105
O  -1.454463 -2.163176 -1.366559
C  1.888049 -1.742097 0.081255
C  0.918591 -1.821914 -1.143708
C  2.412542 -0.295128 0.202696
C  1.197339 -2.190277 1.406604
C  3.025784 -2.762503 -0.203699
C  1.536554 0.84625 0.220814
C  -0.531175 -1.404124 -0.919212
C  -0.871703 -0.155648 -0.209598
C  0.047446 0.802016 0.22406
C  3.807699 -0.053984 0.28459
C  2.106381 2.153792 0.301679
C  -2.336381 0.111202 0.007056
C  4.355143 1.243757 0.366353
C  3.494663 2.36062 0.366854
C  -3.235946 0.192929 -1.089549
C  -2.855746 0.261851 1.324961
C  -4.609423 0.436854 -0.876234
C  -4.232563 0.503575 1.537774
C  -5.113246 0.596269 0.436561
H  1.342758 -1.219259 -1.973211
H  0.86313 -2.8658 -1.500333
H  1.944226 -2.247227 2.218751
H  0.745741 -3.191601 1.278554
H  0.400775 -1.498749 1.72515
H  3.75601 -2.810921 0.624136
H  3.568065 -2.53125 -1.139195
H  2.586068 -3.770579 -0.306959
H  4.495224 -0.902372 0.27901
H  1.429066 3.009871 0.319949
H  5.441479 1.375225 0.42345
H  3.895084 3.378359 0.4204
H  -2.854369 0.050675 -2.10471
H  -2.183854 0.155872 2.185451
H  -1.460255 1.978189 0.724249
H  -5.289133 0.494005 -1.733615
H  -4.614083 0.609246 2.559514
H  -6.180955 0.781284 0.598504
