program: Gaussian 09
title: 000288761
version: EM64L-G09RevD.01
frameworkgroup: C1[X(C8H16N2O)]
method: RPBEPBE
basis: SDD
operation: Freq
keyword: #p
keyword: freq=noraman
keyword: PBEPBE/SDD
title: #p freq=noraman PBEPBE/SDD
converged: YES YES NO NO
title: Mulliken charges:
elementType: O N N C C C C C C C C H H H H H H H H H H H H H H H H
charge: -0.438722 -0.086191 -0.079860 -0.358426 -0.357108 -0.393831 -0.389603 -0.399919 -0.423972 0.170564 -0.758195 0.175445 0.229403 0.209579 0.170501 0.193803 0.203899 0.203495 0.192000 0.214324 0.189859 0.208425 0.217007 0.236135 0.254438 0.253021 0.363929
chargesum: 0.00000
title: Mulliken charges with hydrogens summed into heavy atoms:
elementType: O N N C C C C C C C C
charge: -0.074793 -0.086191 -0.079860 0.046422 0.022973 0.003872 0.005892 0.004264 0.001459 0.170564 -0.014602
polarizability: 1.30633851e+02 9.96864935e+00 9.29507674e+01 -3.86933563e+00 -2.75041795e+00 9.00705268e+01
1716.lowfreq: 0.0006 0.0006 0.0009 4.4233 12.9951 18.5699 42.3997 55.5999 79.7038
frequency: 42.2618 55.4165 79.6350 102.7181 169.4222 229.7459 266.5641 272.0418 296.6254 315.3943 361.3752 388.2979 399.4308 448.3452 456.6421 508.7706 569.8394 630.6243 758.3561 805.8142 807.2658 849.5794 853.0748 878.1870 899.6120 955.4554 959.7650 995.9016 1015.2732 1038.0512 1047.5204 1085.1386 1107.3651 1122.2556 1149.1485 1152.3677 1187.5453 1229.9109 1256.6083 1264.1634 1273.0241 1292.2612 1307.0763 1328.9773 1336.2937 1339.9679 1349.1008 1364.1583 1376.1244 1389.2527 1451.3460 1453.4109 1458.0947 1461.0012 1464.3762 1466.4818 1469.9484 1481.6181 1618.7948 2824.6439 2835.5730 2892.3141 2966.6517 2981.7263 2985.2735 2985.5752 2993.4180 3018.7433 3032.5261 3037.4087 3045.8531 3054.7251 3070.0797 3113.5414 3567.6732
redmass: 3.2908 3.4019 2.8843 1.1667 2.7089 2.0392 3.0631 5.8101 2.1977 4.2661 1.9547 1.7645 1.5264 2.8753 2.1754 2.1490 2.0958 3.5708 3.6158 1.5657 3.4763 2.0922 1.8569 4.3291 2.1906 1.5384 1.3892 2.3893 1.5852 1.6761 2.1283 1.3846 2.4926 2.5807 1.7052 1.6114 1.2862 1.9590 1.3466 1.2299 1.4008 1.4075 1.5505 1.3300 1.4500 1.4464 1.4974 1.4408 1.3034 1.4134 1.0806 1.0884 1.0741 1.0870 1.0601 1.0969 1.0727 1.0976 6.5272 1.0711 1.0702 1.0660 1.0627 1.0395 1.0629 1.0602 1.0908 1.0871 1.0931 1.0908 1.1032 1.1037 1.0918 1.1018 1.0674
irintensity: 0.2554 0.2203 0.3363 0.4539 2.6946 0.6202 0.4737 0.3312 5.7128 1.3040 3.5736 3.3995 98.2656 1.1385 33.9852 24.6968 6.5773 20.4412 8.7036 1.1414 10.4653 3.6500 5.1826 103.5422 6.0894 7.1087 1.0756 22.3773 66.2488 28.7070 8.8763 1.4768 19.4532 3.1779 12.7080 12.7813 1.2927 43.7326 6.3832 2.9998 15.3474 6.0619 9.2185 19.1927 9.9881 1.0548 0.9204 2.1410 46.8322 7.0435 18.4456 1.0673 4.5513 13.1683 12.3475 16.0802 0.7716 8.9984 3.2998 54.9885 129.8774 84.1465 38.7168 8.9557 24.0538 41.1851 20.2130 69.2439 69.0701 20.5873 19.3630 98.0282 11.4029 3.5529 38.1898
temp: 298.150 k
press: 1.00000 atm
elementType: 8 7 7 6 6 6 6 6 6 6 6 1 1 1 1 1 1 1 1 1 1 1 1 1 1 1 1
symmnumber: 1
zpe: 616666.2 jmol-1
zpe.correction: 0.234876 hartree
zpe.thermalcorrener: 0.246828 hartree
zpe.thermalcorrenthalpy: 0.247772 hartree
zpe.thermalcorrgfe: 0.196521 hartree
zpe.sumelectzpe: -498.218255 hartree
zpe.sumelectthermal: -498.206303 hartree
zpe.sumelectthermalent: -498.205359 hartree
zpe.sumelectthermalfe: -498.256610 hartree
dipole: -1.0768 -0.1996 -0.3029
dipole: 1.1363
quadrupole: -65.6735 -64.8452 -68.7417
quadrupole: 1.9221 -1.0255 -0.9744
quadrupole: 0.7466 1.5750 -2.3216 1.9221 -1.0255 -0.9744
hfenergy: -498.4531309 hartree
pointgroup: C01 [X(C8H16N2O1)]
dipole: -0.4229374 -0.0844774 -0.1175928 debye
polarizability: 130.8992123|9.3402394|92.3292202|-4.1948681|-2.7942804|90.4267127 unknown
InChI: InChI=1S/C8H16N2O/c1-8(9-11)7-10-5-3-2-4-6-10/h11H,2-7H2,1H3
charge 0 multiplicity 1
27 atoms
O  3.994631 0.663551 -0.065683
N  -0.555901 -0.40447 -0.010594
N  2.810993 0.123515 -0.767142
C  -0.764839 0.990585 -0.478465
C  -1.732815 -1.262338 -0.302381
C  -2.001917 1.616791 0.195481
C  -3.000639 -0.705796 0.376738
C  -3.25982 0.754902 -0.059449
C  0.70485 -0.989338 -0.52935
C  1.936587 -0.348399 0.09653
C  2.074729 -0.332042 1.598463
H  -0.894626 1.020207 -1.593263
H  0.14102 1.578265 -0.242939
H  -1.519942 -2.283379 0.067765
H  -1.914997 -1.338918 -1.407951
H  -2.1477 2.644782 -0.188626
H  -1.815632 1.688672 1.284648
H  -2.862209 -0.745146 1.474627
H  -3.865522 -1.348958 0.123402
H  -4.132843 1.17106 0.477946
H  -3.505097 0.77602 -1.141846
H  0.703357 -2.066565 -0.264107
H  0.794453 -0.918159 -1.64041
H  2.700492 -1.18082 1.937946
H  1.074429 -0.416488 2.053141
H  2.577157 0.588847 1.939249
H  4.536901 1.006415 -0.821534
