program: Gaussian 09
title: 000288746
version: EM64L-G09RevD.01
frameworkgroup: C1[X(C7H5NO2)]
method: RPBEPBE
basis: SDD
operation: Freq
keyword: #pfreq=noraman
keyword: PBEPBE/SDD
title: #p freq=noraman PBEPBE/SDD
converged: NO NO NO NO
title: Mulliken charges:
elementType: O O N C C C C C C C H H H H H
charge: -0.231286 -0.262715 -0.369035 0.104107 0.249869 0.059065 -0.325340 -0.289345 -0.159989 -0.164452 0.279482 0.258641 0.336620 0.249356 0.265023
chargesum: 0.00000
title: Mulliken charges with hydrogens summed into heavy atoms:
elementType: O O N C C C C C C C
charge: -0.231286 -0.262715 -0.032415 0.104107 0.249869 0.059065 -0.045858 -0.030705 0.089367 0.100571
polarizability: 1.16820903e+02 -4.11975987e+00 1.01303520e+02 5.11798147e-04 -9.26014859e-04 3.51443962e+01
1716.lowfreq: -3.1889 -0.0008 0.0004 0.0009 5.8786 8.8096 153.9284 203.1505 256.0938
frequency: 153.9281 203.1412 256.0922 289.2354 470.9621 505.4277 520.8024 573.2972 582.2051 633.2486 666.7538 721.4403 742.2892 767.1833 777.3835 830.9500 887.3402 892.5080 911.5558 966.3666 1004.9161 1054.0942 1099.0369 1143.6268 1214.7322 1257.5072 1263.7327 1389.2792 1414.3357 1433.5392 1501.9981 1562.6923 1590.9054 1666.1555 3177.7519 3216.5092 3235.9868 3273.2609 3517.5261
redmass: 6.3035 5.3965 4.2123 6.9671 6.6418 8.1657 3.8860 5.9182 3.4818 3.6745 7.8086 1.3787 1.3140 1.4933 4.1769 6.5148 1.3526 5.0817 1.2798 3.0192 5.3204 2.0164 1.5843 2.2413 1.5341 1.8322 2.2210 2.3470 2.6460 3.9723 5.0375 8.4059 4.4976 7.5857 1.0912 1.0983 1.0926 1.1080 1.0777
irintensity: 10.3619 3.9134 4.7906 10.0600 5.9092 2.2539 0.7374 4.4079 0.4979 9.4699 0.4827 49.8523 192.2004 2.4742 7.6594 5.7270 10.3955 1.5389 1.0831 11.9704 24.5784 14.8577 30.1527 39.7937 28.8221 1.3665 15.3822 11.9505 4.0039 4.2714 11.2067 6.3475 69.1447 454.0680 2.1118 2.4754 3.4826 0.0130 55.4786
temp: 298.150 k
press: 1.00000 atm
elementType: 8 8 7 6 6 6 6 6 6 6 1 1 1 1 1
symmnumber: 1
zpe: 283333.7 jmol-1
zpe.correction: 0.107916 hartree
zpe.thermalcorrener: 0.114983 hartree
zpe.thermalcorrenthalpy: 0.115928 hartree
zpe.thermalcorrgfe: 0.076249 hartree
zpe.sumelectzpe: -474.243932 hartree
zpe.sumelectthermal: -474.236864 hartree
zpe.sumelectthermalent: -474.235920 hartree
zpe.sumelectthermalfe: -474.275599 hartree
dipole: -0.1193 3.3211 0.0000
dipole: 3.3233
quadrupole: -46.1573 -59.3259 -60.0040
quadrupole: -12.9235 0.0004 0.0001
quadrupole: 9.0051 -4.1635 -4.8416 -12.9235 0.0004 0.0001
hfenergy: -474.3518478 hartree
pointgroup: C01 [X(C7H5N1O2)]
dipole: -0.0497642 1.3065264 -0.0000074 debye
dipolederiv: -0.563534 0.0430542 -0.0000012 -0.2050484 -0.440508 0.0000024 0.0000145 0.0000077 -0.1332045 -0.6276173 -0.4089645 -0.0000028 -0.4428386 -1.2157604 -0.0000126 0.0000275 0.0000532 -0.3758965 -0.2988084 0.3135454 -0.0000048 -0.5833894 -0.7102155 0.0000155 0.0000107 -0.0000059 -0.2903749 -0.2426505 -0.5015432 0.0000054 -0.2533766 -0.3333562 0.0000019 0.0000035 -0.0000023 -0.0245607 0.5825752 -0.102687 -0.0000058 0.1538061 0.4195049 0.0000057 -0.0000089 -0.0000029 0.0878033 0.7292649 0.3614602 0.0000018 0.561923 1.6433256 0.0000017 -0.0000265 -0.000044 0.1998402 -0.0946112 0.022873 0.0000064 -0.0779065 -0.0204503 -0.0000027 -0.0000018 -0.0000027 -0.1695466 -0.3583132 0.1422083 0.0000016 -0.0691021 -0.1292268 -0.0000023 0.0000038 0.0000049 -0.2188912 0.391121 0.081564 -0.0000069 0.6907388 0.1918642 -0.0000051 -0.0000043 -0.0000014 -0.07488 -0.0020246 -0.0206902 0.0000097 0.144575 0.3203753 -0.0000142 -0.0000146 -0.0000142 -0.1448692 0.1217841 0.0021598 -0.0000015 0.0476469 0.027842 0.0000038 -0.0000017 0.0000044 0.1956484 0.0950875 -0.0302472 -0.0000001 -0.0018583 -0.0099709 0.000002 -0.0000008 0.0000005 0.2020408 0.2264295 0.002064 0.0000019 -0.022356 0.1490683 -0.0000006 0.0000021 -0.0000003 0.3348529 0.0163453 0.0770851 0.0000021 0.0567272 0.0107026 0.0000007 -0.0000059 -0.0000007 0.1886191 0.0249516 0.0181181 -0.0000057 0.000459 0.0968052 0.0000038 0.0000025 0.0000038 0.2234189 unknown
polarizability: 116.8385702|-4.0863131|101.2858528|0.0005138|-0.0009249|35.1443962 unknown
InChI: InChI=1S/C7H5NO2/c9-7-5-2-4-10-6(5)1-3-8-7/h1-4,8H
charge 0 multiplicity 1
15 atoms
O  2.012918 0.893786 -0.000002
O  -1.679358 -2.092731 0.000057
N  -2.03451 0.229257 0.000012
C  0.227404 -0.551586 0.000009
C  0.615583 0.802491 0.0000
C  -1.177827 -0.927331 -0.000013
C  1.438741 -1.341711 0.000037
C  -0.285419 1.903187 -0.000015
C  -1.62991 1.55671 0.000003
C  2.491755 -0.449167 0.00006
H  1.497904 -2.427556 0.000052
H  0.039993 2.94302 -0.000025
H  -3.033893 0.001424 0.000026
H  -2.423927 2.307291 0.000008
H  3.573245 -0.550784 0.00009
