program: Gaussian 09
title: 000288769
version: EM64L-G09RevD.01
frameworkgroup: C1[X(C19H18O)]
method: RPBEPBE
basis: SDD
operation: Freq
keyword: #pfreq=noraman
keyword: PBEPBE/SDD
title: #p freq=noraman PBEPBE/SDD
converged: YES YES NO NO
title: Mulliken charges:
elementType: O C C C C C C C C C C C C C C C C C C C H H H H H H H H H H H H H H H H H H
charge: -0.237861 0.017168 0.525345 -0.364305 0.312876 0.092292 -0.705712 -0.707961 -0.118876 -0.709244 -0.423031 -0.375580 0.478142 -0.254620 -0.245007 -0.422245 -0.380729 -0.226386 -0.232755 -0.244634 0.236635 0.225252 0.244362 0.215098 0.226634 0.214864 0.239407 0.207049 0.253784 0.240436 0.287303 0.229438 0.236307 0.219828 0.276491 0.221116 0.223756 0.225362
chargesum: 0.00000
title: Mulliken charges with hydrogens summed into heavy atoms:
elementType: O C C C C C C C C C C C C C C C C C C C
charge: -0.237861 0.017168 0.525345 -0.127670 0.312876 0.092292 -0.020999 -0.027057 -0.118876 -0.248411 -0.182594 -0.088277 0.478142 -0.025182 -0.008700 -0.202417 -0.104237 -0.005270 -0.008999 -0.019272
polarizability: 2.43343376e+02 -6.47381803e+00 2.19155167e+02 -3.16422643e+00 1.73580613e+00 1.39298986e+02
1716.lowfreq: -8.3129 -0.0006 -0.0005 0.0005 6.1974 16.8207 22.6996 34.0476 38.5528
frequency: 22.2435 33.9492 38.5111 65.1554 106.1282 112.7480 167.1189 193.3461 203.1032 217.7522 244.2074 259.3550 297.7538 311.5154 322.9932 346.2856 364.1436 404.6398 413.2922 434.9988 466.2194 474.3347 488.1969 519.4202 553.9338 576.0161 598.6657 617.7481 646.1373 697.2520 704.6812 722.5060 752.7422 766.3006 773.9904 792.8070 833.6710 855.7443 885.7390 896.2149 906.2617 907.7812 930.1659 932.0007 950.2094 976.6391 978.2163 979.1821 989.4575 997.6900 1005.3071 1010.0210 1027.2782 1036.7029 1074.6548 1083.5639 1110.4542 1114.0447 1147.0416 1170.2814 1174.9812 1181.1289 1188.0993 1197.0080 1205.6190 1260.2781 1266.5042 1302.0882 1310.5652 1328.8445 1372.4556 1375.3036 1382.5899 1386.7054 1399.0179 1439.3418 1440.8314 1459.8544 1461.9494 1463.0279 1470.0313 1477.7124 1481.7666 1488.3029 1538.0508 1579.4403 1592.2353 1611.2884 1614.5423 1650.8953 2981.2172 2982.8696 3005.5826 3066.0182 3076.5941 3077.4181 3082.4149 3091.6242 3095.0071 3109.7622 3122.4377 3122.9975 3135.0749 3137.5696 3146.4267 3151.1122 3161.0889 3166.0690
redmass: 3.9990 5.7855 3.9409 4.2634 4.7154 3.6243 2.6440 4.2044 4.5138 1.2109 1.2184 2.2345 2.9176 3.2675 3.5000 5.4838 2.6589 2.8407 3.4923 3.5413 6.7171 2.9964 3.8296 4.2705 3.2174 3.8558 4.2243 6.3347 4.9796 5.7212 1.9558 2.7647 3.1312 2.9229 1.6030 3.0041 3.5040 1.2560 2.0296 1.5135 1.7347 1.9870 1.5343 1.6084 3.0427 1.3963 1.7477 1.5493 5.9177 1.3245 1.3373 1.2980 2.2468 2.3710 2.0490 1.9634 3.6616 1.9246 1.7747 1.0657 1.0748 1.2067 1.1514 2.1540 2.5463 1.7218 2.7170 1.4358 2.3282 1.2805 2.4562 1.1708 5.3731 5.7929 1.3314 2.3822 2.2263 1.1379 1.0498 1.0527 1.9293 1.0614 2.1931 1.2589 9.3318 7.3736 6.0784 6.0739 6.4042 8.2841 1.0342 1.0346 1.0591 1.1026 1.1001 1.0938 1.0957 1.1011 1.1007 1.0870 1.0861 1.0863 1.0920 1.0897 1.0958 1.0937 1.1015 1.1000
irintensity: 0.1799 1.4029 0.2082 0.6883 3.9657 0.2492 0.1106 0.4132 0.6980 0.0213 0.4171 1.0568 1.3586 0.1569 5.9453 0.2026 8.5855 0.2538 1.4136 1.1563 0.8030 1.4141 12.6266 4.0602 8.1502 3.8979 19.3122 0.6761 3.8851 2.4850 44.3100 51.5065 13.2015 14.3956 56.1531 9.5300 0.5237 0.5866 2.5956 0.8250 6.4698 7.7891 0.2558 3.9365 19.5215 2.0450 15.3748 14.3269 1.0997 3.1103 0.0856 0.6247 11.2607 5.8771 2.7484 25.2602 2.7202 1.1382 5.0038 0.0283 2.9460 0.4838 2.2903 2.9045 5.5422 13.9554 86.3461 8.1922 3.7560 3.4435 35.0392 14.1651 1.4286 16.2751 5.3266 24.6422 2.4922 21.6991 0.2599 6.4168 0.1099 15.5287 35.2914 20.1817 150.5250 24.0986 0.9667 15.2414 15.0381 32.6418 20.1574 40.9783 26.4757 3.1875 1.1579 0.7088 78.6954 14.2100 27.9601 10.8322 4.1273 1.0609 25.5009 16.0530 21.4501 11.5308 30.4041 28.6482
temp: 298.150 k
press: 1.00000 atm
elementType: 8 6 6 6 6 6 6 6 6 6 6 6 6 6 6 6 6 6 6 6 1 1 1 1 1 1 1 1 1 1 1 1 1 1 1 1 1 1
symmnumber: 1
zpe: 815376.2 jmol-1
zpe.correction: 0.310560 hartree
zpe.thermalcorrener: 0.327949 hartree
zpe.thermalcorrenthalpy: 0.328893 hartree
zpe.thermalcorrgfe: 0.264337 hartree
zpe.sumelectzpe: -808.644188 hartree
zpe.sumelectthermal: -808.626799 hartree
zpe.sumelectthermalent: -808.625855 hartree
zpe.sumelectthermalfe: -808.690411 hartree
dipole: 2.3968 3.5695 -1.2976
dipole: 4.4910
quadrupole: -107.6169 -110.8188 -119.2133
quadrupole: -2.1978 -0.6296 5.1180
quadrupole: 4.9328 1.7309 -6.6637 -2.1978 -0.6296 5.1180
hfenergy: -808.9547485 hartree
pointgroup: C01 [X(C19H18O1)]
dipole: 0.95385 -1.387167 0.5365739 debye
polarizability: 243.3059587|6.6737669|219.2640114|2.3608962|-0.1209449|139.2275587 unknown
InChI: InChI=1S/C19H18O/c1-19(2)13-15(12-14-8-4-3-5-9-14)18(20)16-10-6-7-11-17(16)19/h3-11,13H,12H2,1-2H3
charge 0 multiplicity 1
38 atoms
O  -0.038011 2.057679 -1.240766
C  1.626343 -1.686522 0.023314
C  2.384669 -0.363465 0.180031
C  0.267659 -1.506227 -0.621957
C  -0.293848 -0.32765 -1.026103
C  1.821394 0.873168 -0.247316
C  1.39539 -2.341945 1.427923
C  2.449391 -2.676796 -0.867842
C  0.461175 0.944595 -0.862509
C  -1.69161 -0.249977 -1.636399
C  3.678427 -0.34798 0.762282
C  2.548834 2.084962 -0.090875
C  -2.788577 -0.059767 -0.585072
C  4.39542 0.855587 0.915941
C  3.829174 2.08252 0.486312
C  -3.612591 -1.146558 -0.196718
C  -2.993017 1.204371 0.028248
C  -4.616185 -0.980542 0.785811
C  -3.994643 1.371887 1.010178
C  -4.809183 0.280518 1.394733
H  -0.304324 -2.43777 -0.753498
H  2.359143 -2.565107 1.918981
H  0.816563 -1.669978 2.084735
H  0.838522 -3.290968 1.320895
H  3.425474 -2.903734 -0.404092
H  1.90027 -3.628704 -0.989618
H  2.632018 -2.247455 -1.868252
H  -1.888349 -1.174407 -2.209231
H  -1.707121 0.601659 -2.340111
H  4.13512 -1.284753 1.100854
H  2.074276 3.009662 -0.434933
H  5.393323 0.840924 1.368516
H  4.386049 3.018063 0.604619
H  -3.473632 -2.126661 -0.671151
H  -2.362361 2.048401 -0.273392
H  -5.248224 -1.829861 1.070498
H  -4.142811 2.354689 1.472542
H  -5.587748 0.41274 2.154721
