program: Gaussian 09
title: 000288754
version: EM64L-G09RevD.01
frameworkgroup: C1[X(C13H20N2O)]
method: RPBEPBE
basis: SDD
operation: Freq
keyword: #p
keyword: freq=noraman
keyword: PBEPBE/SDD
title: #p freq=noraman PBEPBE/SDD
converged: YES YES NO NO
title: Mulliken charges:
elementType: O N N C C C C C C C C C C C C C H H H H H H H H H H H H H H H H H H H H
charge: -0.280364 -0.095592 -0.098124 -0.179080 -0.379153 -0.379589 -0.383375 0.278422 -0.637312 -0.637816 0.150492 -0.315910 -0.376842 -0.263936 -0.236222 -0.539675 0.229691 0.222303 0.168459 0.168515 0.222170 0.185638 0.221852 0.190504 0.216498 0.249191 0.249800 0.216727 0.190082 0.278888 0.235249 0.224594 0.220970 0.242431 0.220277 0.220237
chargesum: 0.00000
title: Mulliken charges with hydrogens summed into heavy atoms:
elementType: O N N C C C C C C C C C C C C C
charge: -0.280364 -0.095592 -0.098124 0.050611 0.011609 0.011096 0.024114 0.278422 0.018881 0.018793 0.150492 -0.037022 -0.141592 -0.039341 -0.015252 0.143271
polarizability: 1.88268455e+02 -3.87867838e+00 1.56459758e+02 -5.74332224e-01 4.48188361e+00 1.21871694e+02
1716.lowfreq: -20.4126 -6.4902 -0.0009 -0.0009 -0.0009 8.3584 27.6735 58.4165 76.2046
frequency: 27.6467 58.0210 76.0543 96.7277 127.5228 136.5472 173.1323 193.3716 205.4528 213.8466 252.3464 252.9002 287.6474 313.2432 329.7334 340.8153 359.9705 429.2902 436.0445 444.6974 482.5429 499.6135 552.3853 555.9098 561.7129 624.8804 735.7599 752.5146 756.8922 791.0420 833.3383 835.4051 856.5455 901.4449 920.6822 941.0731 959.1930 974.8938 987.7565 995.6918 1034.2415 1042.1411 1081.8334 1082.7176 1098.5289 1103.6692 1110.9008 1116.4735 1126.1690 1147.9973 1159.3980 1169.9763 1173.1056 1189.7359 1203.3295 1220.4752 1236.4668 1262.1436 1265.2768 1284.3588 1328.3326 1332.8653 1345.8909 1359.7549 1369.2344 1394.7304 1427.3010 1428.7122 1431.8553 1442.8652 1444.8135 1458.6430 1462.1345 1466.9633 1470.4379 1471.6479 1475.0462 1480.0089 1482.3793 1486.6959 1596.7328 1605.9241 2769.9474 2809.0549 2819.7365 2864.9799 2867.5224 2958.2606 2999.3639 3021.8673 3028.3175 3031.1874 3032.5266 3045.4657 3070.9670 3094.2035 3095.2219 3120.7025 3127.3795 3146.2974 3161.1710 3170.2757
redmass: 3.5529 3.1509 3.8905 3.2192 3.3198 2.2169 2.7670 2.8970 1.3797 1.1124 2.2524 1.2720 2.8223 2.7304 3.1244 2.2310 2.2147 2.6604 4.0441 3.9266 4.9833 3.2956 2.4217 3.8254 4.2008 4.7996 3.2574 4.5506 1.3890 3.2241 1.9798 4.0886 1.9918 1.3896 2.5528 1.3904 2.9222 1.3322 8.7557 2.3129 1.7472 2.0869 2.4435 1.8454 2.0352 1.3718 1.2599 1.5470 1.6105 1.4184 3.7594 1.1357 2.1199 1.5527 1.5017 3.2512 2.2538 1.5183 1.5326 1.4201 1.2445 1.8744 1.4317 1.3772 1.4467 4.3737 1.2116 1.2274 1.2979 1.0984 1.6762 1.0653 1.0597 1.0515 1.2315 1.0799 1.0779 1.0501 1.0603 1.8679 7.1616 6.4831 1.0787 1.0710 1.0699 1.0567 1.0566 1.0328 1.0629 1.0868 1.0847 1.0744 1.0754 1.1038 1.1023 1.0992 1.0990 1.0992 1.0856 1.0903 1.0935 1.0991
irintensity: 0.0222 1.2324 2.2067 5.4762 2.4565 0.9179 0.5011 0.3219 0.0602 0.1356 1.6011 0.2698 7.0861 0.0345 0.1292 3.3138 2.9628 3.4984 0.3772 2.1101 4.7968 3.6470 0.2050 0.3882 5.0484 3.3239 7.7948 14.1328 88.6297 10.0216 0.9944 7.5659 1.8740 4.9192 3.6258 4.3928 18.4927 0.5976 41.1295 3.2673 48.4514 19.2832 42.9191 5.3468 30.1694 15.5532 0.1589 6.9489 5.1997 0.3581 12.8718 12.5588 0.2401 2.8599 16.7194 104.8227 28.2113 15.0518 37.1567 7.9415 7.1716 22.4802 0.0264 5.5712 23.4439 15.5548 9.5173 12.3165 6.8080 13.8966 7.1637 18.9387 16.1157 12.8853 71.1822 0.2162 11.9865 14.2921 6.4157 12.3112 15.6841 24.2149 32.2367 6.0093 202.8229 105.2734 147.2387 73.0255 25.5324 45.9532 48.1333 65.1688 45.7792 46.0096 38.8379 12.6140 47.8096 23.4276 2.6202 18.9308 19.2522 15.7973
temp: 298.150 k
press: 1.00000 atm
elementType: 8 7 7 6 6 6 6 6 6 6 6 6 6 6 6 6 1 1 1 1 1 1 1 1 1 1 1 1 1 1 1 1 1 1 1 1
symmnumber: 1
zpe: 809756.1 jmol-1
zpe.correction: 0.308420 hartree
zpe.thermalcorrener: 0.324430 hartree
zpe.thermalcorrenthalpy: 0.325374 hartree
zpe.thermalcorrgfe: 0.265314 hartree
zpe.sumelectzpe: -690.824041 hartree
zpe.sumelectthermal: -690.808030 hartree
zpe.sumelectthermalent: -690.807086 hartree
zpe.sumelectthermalfe: -690.867147 hartree
dipole: 1.4268 2.1820 0.3388
dipole: 2.6290
quadrupole: -83.5161 -92.7480 -96.9753
quadrupole: 2.7366 0.2723 0.4225
quadrupole: 7.5637 -1.6682 -5.8955 2.7366 0.2723 0.4225
hfenergy: -691.1324603 hartree
pointgroup: C01 [X(C13H20N2O1)]
dipole: -0.4208228 -0.7660645 -0.5530973 debye
polarizability: 188.5948619|2.5900346|143.0378591|-1.7039112|17.1038571|134.9671858 unknown
InChI: InChI=1S/C13H20N2O/c1-14-9-6-10-15(2)13(14)11-7-4-5-8-12(11)16-3/h4-5,7-8,13H,6,9-10H2,1-3H3
charge 0 multiplicity 1
36 atoms
O  -1.164305 -1.749905 -1.148155
N  1.549572 1.019874 -0.737307
N  1.672435 -0.425347 1.247448
C  0.951433 -0.167435 -0.041839
C  3.002107 0.838783 -0.985213
C  3.127401 -0.630356 1.03384
C  3.742302 0.591765 0.336588
C  -0.523632 0.102134 0.243695
C  0.841672 1.331599 -2.000339
C  1.089556 -1.57051 1.984404
C  -1.567049 -0.689236 -0.310164
C  -0.866719 1.182486 1.086219
C  -2.924186 -0.399732 -0.019067
C  -2.214638 1.482464 1.384161
C  -3.240552 0.68641 0.828037
C  -2.210448 -2.58237 -1.743279
H  1.03946 -1.073768 -0.707894
H  3.381051 1.751466 -1.481403
H  3.19351 -0.023262 -1.681059
H  3.322802 -1.546086 0.411647
H  3.598145 -0.797047 2.020439
H  4.817593 0.415951 0.142091
H  3.640019 1.477767 0.988031
H  0.879584 0.495682 -2.743335
H  1.3083 2.22154 -2.459265
H  -0.216093 1.5639 -1.797392
H  0.03448 -1.369217 2.230095
H  1.644578 -1.704412 2.930093
H  1.137819 -2.531825 1.413347
H  -0.04399 1.774679 1.498806
H  -3.731544 -1.005067 -0.441615
H  -2.46191 2.324107 2.039689
H  -4.291541 0.90555 1.049167
H  -1.673394 -3.327698 -2.348657
H  -2.880533 -1.987165 -2.394021
H  -2.810486 -3.095816 -0.966695
