program: Gaussian 09
title: 000288744
version: EM64L-G09RevD.01
frameworkgroup: C1[X(C13H12N2O2)]
method: RPBEPBE
basis: SDD
operation: Freq
keyword: #p
keyword: freq=noraman
keyword: PBEPBE/SDD
title: #p freq=noraman PBEPBE/SDD
converged: YES YES NO NO
title: Mulliken charges:
elementType: O O N N C C C C C C C C C C C C C H H H H H H H H H H H H
charge: -0.323012 -0.263754 -0.297168 0.001694 0.259059 -0.161931 0.340729 -0.218763 -0.305566 -0.598197 -0.322025 0.457502 -0.367830 0.276173 -0.811399 -0.144612 -0.485014 0.305409 0.242933 0.241754 0.237722 0.285111 0.234599 0.224612 0.234476 0.232086 0.243526 0.234246 0.247640
chargesum: 0.00000
title: Mulliken charges with hydrogens summed into heavy atoms:
elementType: O O N N C C C C C C C C C C C C C
charge: -0.323012 -0.263754 -0.297168 0.001694 0.259059 0.143479 0.340729 0.024169 -0.063811 -0.360475 -0.036914 0.457502 -0.133231 0.276173 -0.120225 -0.144612 0.240399
polarizability: 2.20658846e+02 -1.27981803e+01 1.58163159e+02 1.02382767e+00 -1.39378193e+01 1.05295557e+02
1716.lowfreq: -6.9099 -3.1105 -0.0009 -0.0007 -0.0006 6.5668 30.8891 35.0734 51.6974
frequency: 30.7718 34.9961 51.6965 71.4007 87.5779 93.7294 124.7822 156.0306 157.7126 198.7221 247.8934 263.7214 302.5610 334.8217 345.6314 385.4501 402.0997 421.2894 465.5825 477.3256 503.5716 537.7196 571.9217 601.9006 655.7447 692.8433 707.2549 716.7663 727.0750 773.8246 804.7799 827.2660 885.3678 895.5622 912.5218 939.7008 961.1664 967.5725 995.6182 1004.6822 1020.3805 1048.9644 1085.2377 1119.1231 1141.6649 1151.1416 1174.2217 1186.9816 1217.6522 1252.5635 1270.1158 1286.9159 1293.5805 1361.6944 1369.1947 1385.7320 1400.3144 1426.1544 1431.8176 1451.1329 1467.6074 1470.6946 1479.4876 1495.8900 1578.6376 1621.1044 1643.2462 1658.4058 2183.0839 2978.0090 3008.0266 3055.2698 3056.6228 3084.7387 3112.5938 3119.9708 3131.4184 3132.7796 3150.1821 3171.9636 3201.4349
redmass: 1.1191 5.4074 3.8435 2.6270 1.6153 5.7096 3.6248 4.0003 3.8901 4.0182 3.7349 5.3416 4.7376 4.9615 5.5444 3.6227 7.4005 4.0625 3.5634 7.4185 4.9694 5.2488 4.2555 4.2243 6.5217 10.0555 2.9807 3.1311 5.8970 2.2290 5.1512 1.3930 3.4566 1.6923 5.2498 3.7313 1.3434 1.3363 2.5870 1.7074 6.0814 1.5509 4.1064 1.2549 1.7829 1.5261 1.3280 1.4470 2.3101 1.9602 2.3039 1.9224 1.5165 1.7070 1.8898 5.7887 1.2591 1.6219 1.7058 1.0497 1.0539 1.0453 1.1942 2.8674 6.8361 6.3211 10.1412 7.1455 12.5667 1.0372 1.0293 1.0829 1.0976 1.0990 1.1051 1.0916 1.0910 1.0882 1.1050 1.0990 1.0936
irintensity: 0.7001 1.5859 1.9775 0.9981 2.0207 2.8576 0.7859 6.1932 2.1681 1.6749 5.7849 4.7065 6.2875 8.6436 7.1250 0.7427 3.2530 0.7960 15.1525 1.8218 2.3411 0.4251 2.6361 3.2680 3.4694 14.8223 16.9247 8.5170 7.0767 8.2834 13.0285 42.1821 3.7199 5.0485 43.2783 2.3672 0.5511 5.7375 29.9358 10.2703 104.8987 13.1564 84.4658 0.0883 90.2712 23.7330 11.5698 8.8245 96.7160 208.9867 16.5746 250.8222 2.6828 4.7085 86.8734 0.7473 10.8846 28.9335 36.2624 14.0509 14.1740 13.1021 20.9066 90.3109 5.3928 19.9712 255.9402 23.2304 0.2415 40.5394 43.7565 7.3588 19.3112 17.2694 22.6459 14.3649 16.7894 7.4893 13.8890 10.5489 0.8723
temp: 298.150 k
press: 1.00000 atm
elementType: 8 8 7 7 6 6 6 6 6 6 6 6 6 6 6 6 6 1 1 1 1 1 1 1 1 1 1 1 1
symmnumber: 1
zpe: 581459.3 jmol-1
zpe.correction: 0.221466 hartree
zpe.thermalcorrener: 0.237478 hartree
zpe.thermalcorrenthalpy: 0.238422 hartree
zpe.thermalcorrgfe: 0.176441 hartree
zpe.sumelectzpe: -761.304164 hartree
zpe.sumelectthermal: -761.288152 hartree
zpe.sumelectthermalent: -761.287208 hartree
zpe.sumelectthermalfe: -761.349189 hartree
dipole: 0.5108 -0.2198 -3.1439
dipole: 3.1927
quadrupole: -75.6287 -101.2331 -106.6131
quadrupole: 4.8482 6.7106 -13.8710
quadrupole: 18.8629 -6.7414 -12.1215 4.8482 6.7106 -13.8710
hfenergy: -761.5256302 hartree
pointgroup: C01 [X(C13H12N2O2)]
dipole: 0.2467108 0.0998523 1.2276025 debye
polarizability: 221.5098575|9.1040244|156.507155|-5.8138445|-15.1570649|106.1005493 unknown
InChI: InChI=1S/C13H12N2O2/c1-9-3-6-12-10(7-9)4-5-11(8-14)15(12)13(16)17-2/h3-7,11H,1-2H3
charge 0 multiplicity 1
29 atoms
O  -3.090549 0.842135 0.376153
O  -1.41389 2.463393 0.197815
N  -0.899401 0.146983 0.210444
N  -1.939299 -2.277311 -2.126244
C  0.52647 0.277137 0.031817
C  -1.480174 -1.224358 0.305203
C  1.358503 -0.770374 0.535799
C  -0.590487 -2.156901 1.117472
C  0.746898 -1.924822 1.197658
C  2.766267 -0.665203 0.397962
C  1.122326 1.394714 -0.598051
C  3.375518 0.441679 -0.231534
C  2.524606 1.465585 -0.725004
C  -1.751399 1.2565 0.254318
C  4.883047 0.540231 -0.380363
C  -1.733829 -1.797763 -1.053364
C  -4.070941 1.948796 0.446072
H  -2.46446 -1.123094 0.791321
H  -1.0732 -3.018188 1.58774
H  1.396087 -2.608754 1.756537
H  3.390731 -1.476826 0.792393
H  0.499741 2.21145 -0.964651
H  2.965178 2.338975 -1.220716
H  5.393997 -0.316719 0.090989
H  5.179925 0.563647 -1.445882
H  5.273559 1.464194 0.085466
H  -3.876243 2.57836 1.330136
H  -5.046535 1.448353 0.520373
H  -4.01015 2.568182 -0.463762
