program: Gaussian 09
title: 000288748
version: EM64L-G09RevD.01
frameworkgroup: C1[X(C14H22N2O2)]
method: RPBEPBE
basis: SDD
operation: Freq
keyword: #p
keyword: freq=noraman
keyword: PBEPBE/SDD
title: #p freq=noraman PBEPBE/SDD
converged: NO YES NO NO
title: Mulliken charges:
elementType: O O N N C C C C C C C C C C C C C C H H H H H H H H H H H H H H H H H H H H H H
charge: -0.216076 -0.262970 -0.075989 -0.075965 -0.137728 -0.383744 -0.383741 -0.380906 0.375931 -0.641732 -0.641731 0.204131 -0.411203 -0.535694 -0.392186 0.317889 -0.542003 -0.538572 0.154562 0.221099 0.162790 0.162780 0.221102 0.183585 0.225089 0.179884 0.217108 0.249341 0.249341 0.217108 0.179879 0.240444 0.251088 0.249097 0.212303 0.212304 0.250487 0.218166 0.218162 0.246568
chargesum: 0.00000
title: Mulliken charges with hydrogens summed into heavy atoms:
elementType: O O N N C C C C C C C C C C C C C C
charge: -0.216076 -0.262970 -0.075989 -0.075965 0.016834 0.000144 0.000141 0.027768 0.375931 0.004601 0.004598 0.204131 -0.170759 -0.284606 -0.143089 0.317889 0.133091 0.144325
polarizability: 2.26584609e+02 3.90917751e+00 1.67143163e+02 -2.94758006e-04 -1.00935853e-02 1.32279316e+02
1716.lowfreq: -0.0002 0.0005 0.0009 3.7399 7.6128 9.7453 36.6929 50.0730 52.5395
frequency: 36.6719 50.0629 52.4537 80.6103 113.6064 117.7339 131.4861 165.8817 172.0693 182.1441 191.4971 224.6816 235.1662 240.1384 246.2662 277.4918 294.4702 309.3127 335.2267 357.0868 387.5089 436.3359 438.5804 445.5805 446.6266 497.5362 513.6345 527.3035 552.0494 576.1622 626.3074 697.5864 727.7530 786.2421 801.6541 815.1676 827.7742 852.3456 894.3206 903.1929 923.3835 950.4550 966.3622 986.1757 1002.4616 1012.6147 1037.1330 1086.2233 1086.7557 1104.1322 1104.8151 1108.8451 1113.4628 1122.8920 1123.5131 1147.8737 1158.2493 1167.8826 1171.5098 1175.4655 1198.8150 1208.0943 1243.8181 1256.4460 1265.3781 1271.7023 1278.4827 1329.7886 1345.4373 1347.0120 1361.2844 1371.5826 1391.7446 1403.5858 1427.9500 1430.5842 1432.9707 1441.2612 1446.3640 1458.8343 1460.9556 1466.2955 1466.3049 1468.8468 1470.9692 1472.3553 1474.8293 1479.9104 1481.7213 1504.2416 1590.9565 1611.7562 2597.1318 2785.5455 2797.6126 2836.8104 2838.7253 2947.3605 2954.9251 3000.6418 3021.3882 3027.9123 3029.8268 3031.3602 3032.4463 3040.8180 3075.7444 3096.4188 3097.2039 3121.8771 3122.6307 3123.6479 3174.7541 3177.9008
redmass: 4.2333 3.1948 3.3086 3.1356 3.5685 3.6251 2.3083 3.1504 2.6257 2.1199 2.1400 1.1041 1.8986 2.2426 1.1148 1.7248 2.7482 2.6679 2.2115 2.0955 3.5311 4.1932 3.8325 4.1804 2.9403 3.5435 5.8158 3.9071 2.4329 3.9296 3.7357 6.5016 2.5970 2.7722 1.5434 4.2444 1.9292 2.8737 5.9671 1.3951 2.5693 1.3726 3.2640 7.8884 2.3093 3.6985 1.7135 1.7090 2.0518 1.3289 1.2602 1.8026 1.2588 1.5961 1.7602 1.3865 1.3788 3.2556 2.3894 1.9834 2.0725 1.6440 1.9343 3.7713 1.5472 1.7568 1.4062 1.2327 1.4299 1.9631 1.3805 1.4413 4.3500 2.1508 1.1649 1.1838 1.1706 1.0954 1.3330 1.0607 1.0555 1.1066 1.0512 1.0503 1.0882 1.0841 1.0678 1.0510 1.0601 2.4405 7.9558 6.4555 1.0755 1.0712 1.0698 1.0586 1.0590 1.0336 1.0333 1.0634 1.0862 1.0823 1.0723 1.0743 1.1023 1.1037 1.1020 1.0992 1.0990 1.0989 1.0981 1.0893 1.0941 1.0897
irintensity: 0.0049 1.6747 4.2252 0.3410 6.2137 1.5772 2.3195 0.0349 0.0066 1.9519 1.5480 0.0047 1.9006 4.0433 0.0917 0.2376 3.2515 0.2100 8.7326 1.7280 1.0879 0.1160 0.1703 0.9260 3.8050 0.6374 3.3711 4.0505 2.3205 18.9688 5.8894 0.2183 2.5246 19.5055 9.2094 16.0087 67.5184 7.2028 20.1734 3.5154 2.5387 1.2672 18.3339 57.7092 3.7092 45.4133 49.2817 23.0783 35.3198 17.3506 0.0033 51.3159 0.2527 6.6502 22.4678 6.2232 0.2332 105.7735 26.8576 0.0378 13.1941 22.4381 39.3747 72.3978 21.8647 103.7458 36.7599 8.9621 0.0910 44.2608 7.3809 25.2545 3.7804 25.2071 13.1849 4.3102 16.2494 13.3456 24.6091 23.9411 7.2424 53.5831 0.9081 25.1636 0.0254 21.0897 48.2096 11.0443 5.9456 68.3137 61.3022 177.5323 99.0666 3.5631 217.0954 100.3461 218.4279 57.0291 76.9893 25.1651 46.2663 45.1779 47.9104 46.9073 68.2430 54.6995 36.6716 4.1866 60.7880 35.8467 11.1627 12.3689 7.1114 6.3434
temp: 298.150 k
press: 1.00000 atm
elementType: 8 8 7 7 6 6 6 6 6 6 6 6 6 6 6 6 6 6 1 1 1 1 1 1 1 1 1 1 1 1 1 1 1 1 1 1 1 1 1 1
symmnumber: 1
zpe: 890684.9 jmol-1
zpe.correction: 0.339244 hartree
zpe.thermalcorrener: 0.357967 hartree
zpe.thermalcorrenthalpy: 0.358911 hartree
zpe.thermalcorrgfe: 0.292966 hartree
zpe.sumelectzpe: -805.166517 hartree
zpe.sumelectthermal: -805.147794 hartree
zpe.sumelectthermalent: -805.146850 hartree
zpe.sumelectthermalfe: -805.212795 hartree
dipole: -1.2788 1.7602 -0.0008
dipole: 2.1757
quadrupole: -95.8666 -101.4627 -108.7882
quadrupole: -13.1124 0.0055 -0.0018
quadrupole: 6.1726 0.5765 -6.7491 -13.1124 0.0055 -0.0018
hfenergy: -805.5057612 hartree
pointgroup: C01 [X(C14H22N2O2)]
dipole: -0.4878117 0.703388 0.0007451 debye
polarizability: 226.7274967|2.6015031|167.0002295|0.0013988|0.0410713|132.2793615 unknown
InChI: InChI=1S/C14H22N2O2/c1-15-8-5-9-16(2)14(15)12-7-6-11(17-3)10-13(12)18-4/h6-7,10,14H,5,8-9H2,1-4H3
charge 0 multiplicity 1
40 atoms
O  -0.053657 1.863551 0.002265
O  -4.329302 -0.642467 -0.000652
N  2.043972 -0.024731 -1.230743
N  2.044131 -0.027358 1.230444
C  1.455406 -0.632267 -0.000762
C  3.521285 -0.131923 -1.249532
C  3.521454 -0.134621 1.248768
C  4.119293 0.52998 0.000289
C  -0.070556 -0.548108 -0.000592
C  1.456825 -0.580136 -2.466572
C  1.457202 -0.585551 2.465128
C  -0.798038 0.680719 0.000847
C  -0.821507 -1.746564 -0.001925
C  -2.219933 0.682543 0.000845
C  -2.228361 -1.771841 -0.001918
C  -2.926445 -0.543942 -0.00054
C  -0.773786 3.136079 0.003804
C  -5.100332 0.600638 0.00061
H  1.710811 -1.746977 -0.001944
H  3.89105 0.358876 -2.168743
H  3.853624 -1.207347 -1.288847
H  3.853751 -1.210149 1.285677
H  3.891378 0.354163 2.168985
H  5.220354 0.418294 0.000094
H  3.865961 1.604563 0.001466
H  1.621491 -1.684171 -2.579559
H  1.917161 -0.077723 -3.335929
H  0.371456 -0.394623 -2.494608
H  0.371835 -0.400124 2.493773
H  1.917689 -0.085099 3.335533
H  1.6219 -1.689841 2.575574
H  -0.272887 -2.696172 -0.003035
H  -2.764144 1.629616 0.001929
H  -2.790873 -2.708989 -0.002974
H  -1.403462 3.249599 0.909087
H  -1.403387 3.251826 -0.901248
H  0.014339 3.903127 0.004778
H  -4.893759 1.206567 -0.90373
H  -4.893902 1.204656 0.90626
H  -6.154237 0.285431 0.000198
