program: Gaussian 09
title: 000288760
version: EM64L-G09RevD.01
frameworkgroup: C1[X(C20H19NO2)]
method: RPBEPBE
basis: SDD
operation: Freq
keyword: #p
keyword: freq=noraman
keyword: PBEPBE/SDD
title: #p freq=noraman PBEPBE/SDD
converged: YES YES NO NO
title: Mulliken charges:
elementType: O O N C C C C C C C C C C C C C C C C C C C C H H H H H H H H H H H H H H H H H H H
charge: -0.238427 -0.250470 -0.174813 0.220350 0.088847 -0.373721 -0.345796 -0.660560 0.340174 -0.309576 -0.333478 0.179081 -0.128501 0.272922 -0.422536 -0.407099 -0.410632 -0.383057 -0.224756 -0.236749 -0.228369 -0.232293 -0.236910 0.249926 0.240013 0.228570 0.282218 0.240733 0.254219 0.189782 0.222139 0.228977 0.181589 0.241310 0.272417 0.266031 0.246687 0.224464 0.228910 0.233309 0.231633 0.233443
chargesum: 0.00000
title: Mulliken charges with hydrogens summed into heavy atoms:
elementType: O O N C C C C C C C C C C C C C C C C C C C C
charge: -0.238427 -0.250470 -0.174813 0.220350 0.088847 0.116217 0.164992 -0.165608 0.340174 0.102346 0.077087 0.179081 -0.128501 0.272922 -0.181225 -0.134681 -0.144602 -0.136369 -0.000293 -0.007840 0.004940 -0.000661 -0.003467
polarizability: 3.45054201e+02 1.63218250e+01 2.48786392e+02 -7.34236053e+00 -1.09314887e+01 1.45447210e+02
1716.lowfreq: -8.6027 -5.0566 -0.0007 -0.0006 -0.0006 9.2108 37.1357 38.5681 49.9115
frequency: 37.1036 38.4538 49.9068 63.3110 67.4819 90.4978 137.6281 151.2318 177.9196 200.7120 225.3871 228.3949 240.3170 270.0400 280.6543 305.5910 335.0797 347.9601 400.3803 409.5400 422.6981 452.2346 463.5322 477.6068 507.1714 527.3234 562.6194 593.9173 610.4378 621.2325 650.7374 664.2108 691.5050 704.9439 708.6466 744.7094 752.7390 788.5446 797.5933 803.8534 828.6523 837.5433 853.8221 862.1679 879.1318 905.9161 935.7027 939.8919 968.2791 979.8582 984.4205 990.2008 994.1419 1001.0712 1010.2821 1015.2561 1018.2741 1027.7800 1049.0313 1077.2625 1079.0180 1088.1565 1098.6429 1138.8049 1149.7691 1164.2309 1167.9904 1173.0563 1174.9155 1184.0104 1191.6227 1194.5114 1210.4942 1249.7978 1259.8059 1271.1437 1279.4827 1290.7530 1311.1648 1330.6379 1340.7888 1353.3479 1370.0360 1375.0591 1398.8505 1416.8019 1431.9273 1439.9890 1445.8990 1448.5706 1451.9586 1454.1783 1457.2269 1464.3010 1479.0819 1535.3450 1572.3239 1584.9818 1602.0897 1607.2456 1617.5188 2936.4221 2941.5635 2972.4348 2975.1882 3011.2039 3015.4914 3077.7242 3082.4027 3085.0100 3085.5369 3118.9752 3124.1545 3129.1525 3132.5134 3140.4822 3146.4782 3150.4242 3161.6758 3166.0713
redmass: 5.3782 4.2192 4.1092 4.7772 4.4792 3.3943 4.3973 5.7100 4.5977 3.2352 3.9113 2.8382 4.2853 4.1304 6.1308 3.2003 4.1578 2.8880 2.0577 2.7763 3.0193 5.3089 2.8564 3.3527 4.0388 4.8924 4.9590 7.0047 4.3756 2.6256 5.5650 5.6707 4.2865 4.7890 1.8446 1.5205 2.6301 2.8193 4.2976 2.9638 1.6421 4.8616 3.5499 1.2659 1.3732 2.6131 1.4421 1.7951 1.5888 5.5329 1.4485 5.2803 1.3306 1.3231 2.4267 2.3732 2.1515 2.0605 1.8549 4.9090 1.6307 2.0931 2.1617 1.1323 4.7402 1.1566 2.0669 1.1052 2.8299 1.1379 1.8583 1.1102 1.7892 1.4134 1.7804 2.6238 1.2415 1.5896 1.3680 1.3192 1.2471 1.3632 1.3252 6.6095 7.4196 3.0822 2.1797 1.3075 1.1089 1.0899 2.1462 1.1548 1.1204 2.1130 2.4174 8.7074 8.7532 6.5008 7.4719 6.1542 7.3948 1.0690 1.0689 1.0672 1.0606 1.0606 1.0994 1.0987 1.0959 1.0950 1.0972 1.0863 1.0854 1.0874 1.0895 1.0920 1.0941 1.0965 1.1000 1.1015
irintensity: 0.7875 0.2127 1.4786 0.5749 0.1360 0.2025 0.6229 3.6455 3.1799 2.7436 4.5906 6.9228 2.6206 4.9685 4.4607 5.4091 5.8492 5.0431 0.1380 0.2502 3.6387 3.0543 3.2304 5.3278 4.7495 9.6426 11.2423 17.9484 5.4683 9.1868 1.9701 2.6394 3.6207 21.8466 29.4112 92.7279 22.7984 22.8878 6.2215 12.6799 0.1508 7.5673 41.3531 2.0725 1.3754 18.9211 3.6124 0.4329 4.6426 44.8786 2.4313 1.6708 0.0295 0.6478 24.8316 2.2599 7.5162 10.7720 13.3755 73.5654 12.5576 44.8139 7.9403 4.4542 2.6969 12.3965 36.9397 2.3144 18.9310 5.3552 22.6425 3.1361 13.6538 53.6405 26.6077 57.2205 4.6063 13.2002 0.8493 10.3408 3.7507 43.7710 7.6366 1.0164 28.9226 55.1294 10.8883 5.1874 9.6296 1.0391 7.6649 49.5306 14.3815 3.0344 28.0227 425.6121 228.9631 54.5575 64.7346 2.2829 11.5135 38.4030 89.2586 46.6679 17.6461 7.9961 10.5991 18.7413 26.0406 20.2272 30.9236 1.9493 3.1990 0.3105 12.0343 11.0740 20.9385 31.6966 45.7221 25.6586
temp: 298.150 k
press: 1.00000 atm
elementType: 8 8 7 6 6 6 6 6 6 6 6 6 6 6 6 6 6 6 6 6 6 6 6 1 1 1 1 1 1 1 1 1 1 1 1 1 1 1 1 1 1 1
symmnumber: 1
zpe: 891642.4 jmol-1
zpe.correction: 0.339609 hartree
zpe.thermalcorrener: 0.358538 hartree
zpe.thermalcorrenthalpy: 0.359482 hartree
zpe.thermalcorrgfe: 0.291761 hartree
zpe.sumelectzpe: -977.079022 hartree
zpe.sumelectthermal: -977.060093 hartree
zpe.sumelectthermalent: -977.059149 hartree
zpe.sumelectthermalfe: -977.126870 hartree
dipole: 2.0526 4.3185 -1.8595
dipole: 5.1304
quadrupole: -122.5736 -133.8519 -133.7726
quadrupole: 6.1245 2.0892 4.8710
quadrupole: 7.4925 -3.7859 -3.7066 6.1245 2.0892 4.8710
hfenergy: -977.418631 hartree
pointgroup: C01 [X(C20H19N1O2)]
dipole: -0.8541881 1.7654822 0.4770054 debye
polarizability: 345.8342281|-15.1388126|249.1702659|-0.5972126|-3.7210277|144.2833087 unknown
InChI: InChI=1S/C20H19NO2/c22-20-17-9-5-4-8-16(17)14-18(20)19(15-6-2-1-3-7-15)21-10-12-23-13-11-21/h1-9H,10-14H2
charge 0 multiplicity 1
42 atoms
O  -3.372115 -3.322586 0.595148
O  1.297425 -2.220061 -0.925272
N  -1.52956 -1.190051 -0.079281
C  -0.784487 -0.018846 -0.183399
C  0.611652 0.02031 -0.077245
C  -2.754649 -1.43031 -0.884934
C  -1.04502 -2.400976 0.619386
C  1.407306 1.263372 0.341116
C  2.852699 0.791027 0.316636
C  -3.855765 -2.084373 -0.031385
C  -2.198598 -3.022453 1.432151
C  2.924855 -0.551376 -0.131456
C  1.552061 -1.075459 -0.410798
C  -1.575752 1.246492 -0.349314
C  4.030395 1.490736 0.643742
C  4.160435 -1.218571 -0.271139
C  -1.256308 2.164054 -1.384926
C  -2.651849 1.551159 0.527533
C  5.274903 0.825498 0.515741
C  5.341408 -0.518756 0.061112
C  -1.990623 3.359768 -1.538322
C  -3.379939 2.75197 0.382282
C  -3.052141 3.659968 -0.652191
H  -2.493117 -2.111141 -1.721411
H  -3.112888 -0.479715 -1.311635
H  -0.22781 -2.110576 1.301786
H  -0.619391 -3.119634 -0.104457
H  1.109424 1.623486 1.345904
H  1.266657 2.121203 -0.344421
H  -4.202175 -1.375168 0.753026
H  -4.711331 -2.382669 -0.659274
H  -1.884357 -3.989409 1.858198
H  -2.498937 -2.336103 2.255399
H  3.993283 2.530482 0.989849
H  4.182714 -2.253262 -0.629304
H  -0.445398 1.919072 -2.080369
H  -2.896201 0.850093 1.334188
H  6.200933 1.354875 0.768669
H  6.31656 -1.009845 -0.031935
H  -1.739738 4.053545 -2.348224
H  -4.198171 2.981472 1.073935
H  -3.619291 4.590261 -0.767806
