program: Gaussian 09
title: 000288762
version: EM64L-G09RevD.01
frameworkgroup: C1[X(C19H17NO3)]
method: RPBEPBE
basis: SDD
operation: Freq
keyword: #p
keyword: freq=noraman
keyword: PBEPBE/SDD
title: #p freq=noraman PBEPBE/SDD
converged: YES YES NO NO
title: Mulliken charges:
elementType: O O O N C C C C C C C C C C C C C C C C C C C H H H H H H H H H H H H H H H H H
charge: -0.225987 -0.207352 -0.183659 0.015624 -0.586238 0.231139 -0.572346 0.011593 0.364614 0.320331 -0.114252 0.363370 -0.436454 -0.444772 -0.374157 -0.842197 -0.791304 0.303205 0.186080 -0.337026 -0.372620 -0.253511 -0.213638 0.245607 0.237327 0.216119 0.244769 0.232868 0.235957 0.298486 0.235810 0.229135 0.237644 0.209429 0.259557 0.240731 0.264880 0.286580 0.240300 0.244357
chargesum: 0.00000
title: Mulliken charges with hydrogens summed into heavy atoms:
elementType: O O O N C C C C C C C C C C C C C C C C C C C
charge: -0.225987 -0.207352 -0.183659 0.015624 -0.103303 0.231139 -0.111458 0.011593 0.364614 0.320331 -0.114252 0.363370 -0.203586 -0.208814 -0.075671 -0.139607 -0.081588 0.303205 0.186080 -0.072146 -0.086041 -0.013210 0.030718
polarizability: 3.84548784e+02 -1.06351166e+01 2.15881748e+02 9.74740308e-02 -5.77314962e+00 1.52847736e+02
1716.lowfreq: -6.7680 -0.0004 -0.0003 0.0003 3.1970 6.6568 19.6313 31.1088 44.7546
frequency: 19.4923 31.1022 44.7152 62.2471 75.4319 79.9182 123.1164 134.1139 163.8571 179.4763 183.2500 205.9336 211.7834 227.6770 274.6696 284.2180 317.5511 325.1313 345.1378 371.9845 385.4514 414.7794 433.8155 434.3174 455.8308 475.8342 484.9173 519.6025 542.0269 551.5662 572.0013 590.1720 623.7606 648.2306 667.3661 682.7582 712.9325 723.0183 741.6619 777.7850 782.8833 790.2937 808.8648 827.5952 837.0720 880.8022 892.4776 908.4239 940.5540 960.2773 964.1105 978.9920 1000.4297 1003.5060 1022.4624 1036.9353 1040.9993 1042.7168 1050.7797 1061.6977 1066.8156 1136.1271 1144.6476 1169.8344 1176.0169 1183.0896 1201.8118 1216.4002 1222.4885 1252.2265 1261.3038 1279.1443 1283.8425 1307.2382 1330.2788 1354.3923 1364.9039 1372.8853 1384.4687 1393.6160 1402.4788 1404.8107 1432.7838 1449.3894 1457.7755 1459.3338 1460.6564 1467.9866 1469.6137 1479.4556 1482.2117 1528.3468 1567.2504 1580.0129 1601.9371 1605.5215 1635.7846 2963.0284 2972.9101 2973.5486 2988.3844 3047.8882 3053.1674 3055.4249 3078.1473 3083.7537 3085.1878 3115.4055 3118.3766 3141.6312 3144.1505 3160.0541 3171.8831 3187.0663
redmass: 6.6830 5.1996 7.7593 5.5628 4.8919 6.1185 3.0352 4.1667 3.1723 3.7613 1.2229 1.2296 2.8352 3.3263 4.7893 3.9956 3.0872 3.3896 4.2611 5.8903 7.1075 3.1424 4.8256 3.6981 4.6303 4.4206 3.8384 4.1509 3.8434 3.7830 4.5074 4.7006 3.3571 6.7186 5.3332 4.6501 3.7949 4.4185 5.1106 3.8291 1.9729 3.1148 3.3988 1.2891 3.2379 2.4627 1.6332 1.7020 2.8720 1.3427 1.9092 1.3685 1.3871 1.8983 1.5144 2.4653 2.0331 1.6286 2.0168 2.9681 2.1614 2.0082 1.8223 1.2555 1.2155 1.5658 6.3067 1.8804 1.7800 3.3378 1.8759 1.7209 2.1439 1.5516 1.7671 4.9895 4.1253 2.7948 2.9579 3.2447 1.2515 1.2722 2.5685 1.0582 1.2810 1.0975 1.1357 2.3741 2.3772 1.0911 1.1087 8.0399 6.1955 5.7405 7.1135 6.7671 8.8630 1.0682 1.0397 1.0629 1.0366 1.0964 1.0959 1.0933 1.0957 1.0982 1.1009 1.0875 1.0874 1.0868 1.0965 1.0910 1.0962 1.0972
irintensity: 0.7343 0.9539 0.7130 0.3577 2.1719 2.3473 0.6926 0.9305 0.4634 1.0182 0.9049 1.2060 2.5428 1.9901 3.4709 6.2182 0.6153 4.0853 4.1217 1.0625 2.1321 2.6949 1.2196 0.1627 2.1232 6.4933 11.5969 10.3933 2.1464 3.4545 10.8756 1.4363 1.5936 10.0089 9.5108 16.0678 3.9718 8.9727 7.2059 1.8411 34.0623 31.8415 5.4493 21.2892 19.9283 44.5715 13.1500 3.0832 10.9886 0.0090 23.8475 4.0212 0.3908 2.6291 7.8790 11.1303 0.6836 11.3564 6.7674 7.5060 9.8775 3.6984 65.5444 15.2822 10.7780 11.5733 234.8684 11.3811 112.9647 1.7035 9.0389 165.0334 68.8536 14.9186 6.5858 55.0668 107.6864 0.6427 23.9924 19.6796 17.9736 13.5778 2.9892 12.2335 6.8284 10.8035 8.7121 49.2654 94.9605 13.8917 27.4857 125.9324 32.5751 55.4161 8.9635 15.8048 7.3393 11.6580 37.9781 17.3278 26.8317 25.4800 21.3672 21.3234 8.8789 16.8420 46.7980 8.6595 12.0017 2.7018 42.2272 12.9948 8.3034 8.1498
temp: 298.150 k
press: 1.00000 atm
elementType: 8 8 8 7 6 6 6 6 6 6 6 6 6 6 6 6 6 6 6 6 6 6 6 1 1 1 1 1 1 1 1 1 1 1 1 1 1 1 1 1
symmnumber: 1
zpe: 818589.0 jmol-1
zpe.correction: 0.311784 hartree
zpe.thermalcorrener: 0.331886 hartree
zpe.thermalcorrenthalpy: 0.332831 hartree
zpe.thermalcorrgfe: 0.261910 hartree
zpe.sumelectzpe: -1012.944232 hartree
zpe.sumelectthermal: -1012.924129 hartree
zpe.sumelectthermalent: -1012.923185 hartree
zpe.sumelectthermalfe: -1012.994106 hartree
dipole: 1.2558 6.8299 -2.5415
dipole: 7.3949
quadrupole: -115.8764 -134.5586 -136.8256
quadrupole: -12.0881 13.6627 3.1796
quadrupole: 13.2104 -5.4718 -7.7387 -12.0881 13.6627 3.1796
hfenergy: -1013.2560158 hartree
pointgroup: C01 [X(C19H17N1O3)]
dipole: -0.2059084 -1.0969768 -2.6867555 debye
polarizability: 384.8461821|-1.4925994|175.6276633|8.4528425|30.5405751|192.8044231 unknown
InChI: InChI=1S/C19H17NO3/c1-12-7-8-13(2)18-16(12)10-9-15(19(18)21)11-14-5-3-4-6-17(14)20(22)23/h3-8,11H,9-10H2,1-2H3
charge 0 multiplicity 1
40 atoms
O  -1.042194 2.011404 1.17351
O  4.673821 0.037721 2.907882
O  2.408276 -0.007153 2.687447
N  3.599266 0.053935 2.18867
C  -1.257985 -1.67594 -0.744989
C  -2.550998 -0.91875 -0.477759
C  -0.127764 -0.727239 -1.206491
C  -2.48897 0.410139 0.061729
C  0.085671 0.353268 -0.167523
C  -3.805207 -1.533966 -0.74575
C  -1.153824 0.99426 0.412198
C  -3.696164 1.150712 0.311515
C  -4.983361 -0.791456 -0.495286
C  -4.927083 0.523013 0.010376
C  1.289908 0.75795 0.350294
C  -3.90772 -2.951986 -1.284667
C  -3.728783 2.559852 0.872563
C  2.630503 0.380686 -0.136259
C  3.751844 0.121926 0.712194
C  2.894599 0.367749 -1.538486
C  5.048921 -0.124461 0.207371
C  4.17874 0.110899 -2.056569
C  5.2650 -0.134753 -1.18248
H  -0.93157 -2.204665 0.174488
H  -1.419608 -2.452885 -1.512046
H  -0.427543 -0.274759 -2.174883
H  0.799699 -1.2992 -1.38402
H  -5.958375 -1.249058 -0.702483
H  -5.858029 1.07429 0.185226
H  1.230993 1.463068 1.189417
H  -4.962927 -3.265736 -1.355957
H  -3.465684 -3.044557 -2.295651
H  -3.3855 -3.679269 -0.635512
H  -4.755391 2.964081 0.821651
H  -3.385532 2.580151 1.921317
H  -3.046029 3.239105 0.333477
H  2.074737 0.612202 -2.220249
H  5.858704 -0.311191 0.917243
H  4.336504 0.116916 -3.140314
H  6.266056 -0.329906 -1.579191
