program: Gaussian 09
title: 000288711
version: EM64L-G09RevD.01
frameworkgroup: C1[X(C7H3Cl2N3O)]
method: RPBEPBE
basis: SDD
operation: Freq
keyword: #p
keyword: freq=noraman
keyword: PBEPBE/SDD
title: #p freq=noraman PBEPBE/SDD
converged: NO NO NO NO
title: Mulliken charges:
elementType: Cl Cl O N N N C C C C C C C H H H
charge: -0.011133 -0.007890 -0.199784 -0.460163 0.004476 -0.063111 0.549331 0.107432 -0.268592 -0.320633 -0.195313 -0.119507 0.042238 0.306878 0.288854 0.346915
chargesum: 0.00000
title: Mulliken charges with hydrogens summed into heavy atoms:
elementType: Cl Cl O N N N C C C C C C C
charge: -0.011133 -0.007890 -0.199784 -0.113248 0.004476 -0.063111 0.549331 0.107432 -0.268592 -0.013755 0.093541 -0.119507 0.042238
polarizability: 1.69512564e+02 1.89380762e+00 1.55686501e+02 -5.64733614e-03 7.41858755e-03 4.37363108e+01
1716.lowfreq: -3.6431 -0.0029 -0.0013 0.0008 5.2596 8.5343 61.6743 115.0624 142.0435
frequency: 61.6281 115.0594 142.0420 168.9329 174.8134 193.1516 307.5462 326.4361 333.8702 388.5992 455.0727 499.2253 509.1785 526.6171 538.4520 565.5106 640.5656 676.0331 703.8252 763.2102 779.5514 809.7818 875.4624 887.6715 925.4773 937.2074 984.3500 1077.1732 1175.6247 1199.9543 1260.1668 1274.8764 1380.9671 1405.3688 1429.6514 1474.0669 1557.8264 1596.7114 1615.2289 3177.3690 3179.0094 3548.1076
redmass: 15.6711 13.2883 6.9727 18.8041 18.0231 5.0995 7.5655 15.6078 14.8994 8.4292 6.2574 9.0354 9.7502 7.4329 11.9872 4.2718 10.2196 4.3336 1.3024 6.9143 10.7869 9.9319 1.4019 5.9915 1.3910 7.3554 10.7308 1.7612 4.1801 2.2975 2.8718 2.2586 7.6876 5.8224 2.4337 2.7475 7.4462 7.7964 12.4050 1.0929 1.0939 1.0798
irintensity: 0.3198 4.1113 1.3296 2.1699 3.5240 0.4959 0.4033 0.9064 11.4110 2.4958 4.7802 2.6997 4.8913 4.8512 2.4996 11.0719 45.2520 9.9046 102.0813 7.7808 27.9984 39.7267 25.8995 17.5309 10.8498 69.3198 22.2029 5.7031 66.8037 9.7555 218.7119 36.0225 29.4393 7.4051 29.3791 137.6583 56.9789 43.7646 198.6301 8.1456 0.6423 99.6660
temp: 298.150 k
press: 1.00000 atm
elementType: 17 17 8 7 7 7 6 6 6 6 6 6 6 1 1 1
symmnumber: 1
zpe: 243089.4 jmol-1
zpe.correction: 0.092588 hartree
zpe.thermalcorrener: 0.103160 hartree
zpe.thermalcorrenthalpy: 0.104105 hartree
zpe.thermalcorrgfe: 0.055168 hartree
zpe.sumelectzpe: -1427.189045 hartree
zpe.sumelectthermal: -1427.178472 hartree
zpe.sumelectthermalent: -1427.177528 hartree
zpe.sumelectthermalfe: -1427.226465 hartree
dipole: 3.1869 5.0313 0.0019
dipole: 5.9557
quadrupole: -100.8207 -95.1406 -87.4118
quadrupole: -11.3682 -0.0045 -0.0041
quadrupole: -6.3630 -0.6829 7.0459 -11.3682 -0.0045 -0.0041
hfenergy: -1427.2816329 hartree
pointgroup: C01 [X(C7H3Cl2N3O1)]
dipole: 1.6772177 1.6362418 0.0007548 debye
dipolederiv: -0.1206167 -0.0243556 0.0000053 -0.0873079 -0.7366095 -0.0000163 -0.0000104 0.0000081 -0.0239792 -0.7071845 0.3101908 0.0000522 0.3903772 -0.2862347 -0.0000324 0.0000577 -0.0000465 -0.0325597 -0.4357494 -0.0856697 0.0000422 -0.4214366 -1.0573647 0.0001986 -0.0001565 -0.0004327 -0.3439664 -1.0792543 -0.2025261 -0.0000151 -0.1226307 -0.4914509 0.0000207 -0.0002893 -0.0001049 -0.1450483 0.7840567 0.4734513 0.0000809 1.0381959 0.5531685 -0.0000057 0.0004273 0.0002228 -0.157526 -0.0476146 0.3683539 0.000118 -0.7111109 -0.7406861 -0.0000503 -0.0000949 0.0000092 -0.1783422 0.433884 -0.3642593 -0.0000539 -0.2694554 -0.1581993 -0.0000758 0.0001063 0.0000416 0.1223603 -0.3316688 -0.4112527 -0.0000792 -0.1942443 -0.1133461 -0.0000073 0.0000538 0.0000322 0.01318 0.0509336 0.2456835 -0.0000073 0.176281 1.196274 0.000041 0.0000258 0.0000034 -0.0695772 -0.3141316 0.3225384 0.0000097 -0.0008076 -0.0719058 -0.0000232 0.0000597 -0.0000219 -0.0640096 -0.1915764 0.0503047 0.0000065 0.2591403 -0.1938097 -0.00002 0.0000179 -0.0000184 -0.0262644 1.0050387 -0.6403072 -0.00011 -0.6550406 0.3104627 0.0000585 -0.0001049 0.0000949 -0.0809543 0.5678982 0.0962653 -0.0000451 0.5865316 1.3161514 -0.0001002 -0.0000824 0.0002633 0.3230926 0.1204619 -0.0357207 0.0000042 0.0341832 0.0759391 0.000007 0.0000066 -0.0000095 0.1656704 0.0580907 -0.0365358 0.0000085 -0.0250245 0.1010363 0.0000022 0.0000124 0. 0.1653072 0.2074325 -0.0661607 -0.0000168 0.0023492 0.2965747 0.0000031 -0.0000291 -0.0000418 0.3326167 unknown
polarizability: 169.625998|-1.4160851|155.5730674|-0.0037807|0.0085226|43.7363108 unknown
InChI: InChI=1S/C7H3Cl2N3O/c8-3-1-4-6(5(9)2-3)10-12-11-7(4)13/h1-2,10H
charge 0 multiplicity 1
16 atoms
Cl 1.17064 3.231383 0.000111
Cl 3.621323 -1.760288 -0.00022
O  -1.863143 -2.481066 -0.000535
N  -1.41033 1.530915 0.000178
N  -2.703646 0.967209 0.000049
N  -2.833291 -0.335921 -0.000001
C  -0.225024 0.80851 0.000197
C  -0.319375 -0.616065 0.0002
C  1.059988 1.416915 0.000096
C  0.854075 -1.409548 0.000045
C  2.223761 0.641429 -0.000019
C  2.101273 -0.772931 -0.000052
C  -1.664144 -1.241107 0.000442
H  0.750791 -2.498237 0.000043
H  3.208543 1.116469 -0.000105
H  -1.418542 2.553332 0.00027
