program: Gaussian 09
title: 000288740
version: EM64L-G09RevD.01
frameworkgroup: C1[X(C12H15NO4)]
method: RPBEPBE
basis: SDD
operation: Freq
keyword: #p
keyword: freq=noraman
keyword: PBEPBE/SDD
title: #p freq=noraman PBEPBE/SDD
converged: YES YES NO NO
title: Mulliken charges:
elementType: O O O O N C C C C C C C C C C C C H H H H H H H H H H H H H H H
charge: -0.432936 -0.276295 -0.279979 -0.282129 -0.393107 -0.214432 0.184128 -0.031098 -0.008690 0.110022 0.166933 0.194148 -0.717754 -0.341198 -0.371097 -0.531286 -0.539125 0.252828 0.229254 0.325030 0.222951 0.247892 0.208496 0.242918 0.254349 0.349849 0.225288 0.222941 0.245667 0.207582 0.302915 0.225936
chargesum: 0.00000
title: Mulliken charges with hydrogens summed into heavy atoms:
elementType: O O O O N C C C C C C C C C C C C
charge: -0.083088 -0.276295 -0.279979 -0.282129 -0.068077 0.038396 0.184128 0.198156 -0.008690 0.110022 0.166933 0.194148 -0.038414 -0.098280 -0.116749 0.162610 0.197309
polarizability: 2.00195246e+02 -6.33691540e+00 1.69895764e+02 1.18581227e+01 8.67626295e+00 9.12648636e+01
1716.lowfreq: -11.3191 -1.7206 0.0003 0.0005 0.0008 3.6998 46.7882 50.2800 66.7378
frequency: 46.7446 50.2389 66.7337 87.0468 88.8224 112.4082 143.4692 167.7719 172.5916 214.5732 231.7753 238.9636 251.5026 265.6508 277.9329 307.2119 340.8632 345.3639 376.1733 415.8130 433.6605 459.6398 477.4948 542.3745 564.3260 590.7946 603.6509 618.0598 650.3720 692.2157 709.8829 759.8028 786.9332 811.6055 816.7874 874.3696 903.2043 937.5590 940.6848 1002.3985 1011.5354 1039.9058 1045.5240 1088.9404 1111.5925 1113.1983 1123.2207 1130.5206 1148.3487 1167.0687 1181.4848 1225.5938 1229.5784 1238.2687 1255.6340 1258.7081 1284.8842 1346.0278 1364.3440 1371.5420 1389.3326 1394.6831 1410.4332 1429.4126 1441.0015 1455.1643 1455.6998 1466.8049 1472.9991 1484.4844 1489.4528 1492.5687 1580.5958 1623.3541 1644.4705 2963.2220 2969.3622 2970.5204 2989.2775 2990.6085 3052.7522 3080.0651 3086.9792 3099.5980 3127.1990 3127.9350 3154.2977 3175.0657 3542.1655 3594.9668
redmass: 3.9456 4.3981 3.1483 2.9681 4.4325 3.3544 3.6199 1.6812 2.9913 1.1182 2.3854 1.6832 2.8297 3.7475 3.9460 3.7603 1.1741 5.1039 5.4105 3.7147 4.3672 5.3232 3.4412 1.4525 4.1846 3.9705 5.4729 4.1986 4.2509 5.8944 5.0852 6.6878 5.9771 4.5297 1.5445 4.1396 3.5591 3.7312 1.3731 2.2060 7.4077 2.9783 2.0690 1.9442 1.5276 1.4245 1.3132 2.2812 1.4280 1.3793 1.3344 3.4383 1.4057 1.7214 2.1410 2.3137 1.9986 1.4813 2.1061 1.3717 3.4368 1.4783 6.5619 1.2987 1.2240 1.0589 1.0493 1.0508 1.1475 1.9234 1.0514 1.0619 8.2313 8.4993 7.8525 1.0327 1.0810 1.0342 1.0483 1.0728 1.1042 1.1023 1.1000 1.0988 1.1042 1.0998 1.0872 1.0960 1.0656 1.0787
irintensity: 0.8659 0.2179 5.2137 0.5934 0.5129 2.4975 7.0664 5.4375 4.3728 5.0765 0.6954 4.8722 3.7438 6.5781 4.9215 2.0567 133.8234 2.1564 4.6970 11.7028 1.9438 11.0747 11.2459 73.5573 21.3588 18.8613 10.4989 17.1546 17.7068 11.8389 12.2851 10.3085 4.5052 13.1189 56.6912 16.5155 9.0315 11.7831 1.3343 19.3306 134.9543 55.7554 41.5963 3.1699 21.0489 14.6647 8.5080 26.8647 1.0660 6.3893 6.9294 177.4554 48.6284 53.5222 27.3611 21.0702 72.6515 26.3546 11.1345 4.2362 39.2272 12.2622 6.8354 32.6928 1.1495 18.7242 5.9942 14.4155 128.7736 162.2069 6.4456 45.0179 24.9353 8.9366 441.4845 72.6761 18.1205 99.4294 20.1055 33.8189 43.0799 37.2194 30.4375 23.5394 11.3347 18.0141 6.2249 7.8960 1.8464 44.8990
temp: 298.150 k
press: 1.00000 atm
elementType: 8 8 8 8 7 6 6 6 6 6 6 6 6 6 6 6 6 1 1 1 1 1 1 1 1 1 1 1 1 1 1 1
symmnumber: 1
zpe: 665529.6 jmol-1
zpe.correction: 0.253487 hartree
zpe.thermalcorrener: 0.270636 hartree
zpe.thermalcorrenthalpy: 0.271580 hartree
zpe.thermalcorrgfe: 0.208834 hartree
zpe.sumelectzpe: -820.631283 hartree
zpe.sumelectthermal: -820.614134 hartree
zpe.sumelectthermalent: -820.613190 hartree
zpe.sumelectthermalfe: -820.675936 hartree
dipole: -3.5050 4.2848 -2.4288
dipole: 6.0452
quadrupole: -95.7665 -91.1912 -104.0395
quadrupole: -0.1671 1.0016 5.9636
quadrupole: 1.2325 5.8079 -7.0404 -0.1671 1.0016 5.9636
hfenergy: -820.88477 hartree
pointgroup: C01 [X(C12H15N1O4)]
dipole: 1.0997487 1.9293731 0.8512611 debye
polarizability: 197.5961729|11.3495214|171.7329953|11.9082072|-10.8963984|92.0267059 unknown
InChI: InChI=1S/C12H15NO4/c1-6(14)11-9-7(16-2)4-5-8(17-3)10(9)12(15)13-11/h4-6,11,13-14H,1-3H3
charge 0 multiplicity 1
32 atoms
O  2.048823 -1.062009 -1.600198
O  1.821271 2.225911 0.388817
O  -3.385751 0.151411 -0.476744
O  -1.635616 -2.666121 0.341795
N  0.514597 -1.875779 0.87513
C  1.344788 -0.668921 0.781596
C  0.308987 0.365758 0.36568
C  2.529075 -0.799331 -0.238611
C  -0.963851 -0.240992 0.181111
C  -0.805068 -1.716723 0.455364
C  0.520445 1.740597 0.147835
C  -2.074545 0.555421 -0.228193
C  3.4824 -1.949172 0.100586
C  -0.573801 2.526717 -0.296689
C  -1.839012 1.934386 -0.473546
C  2.047067 3.662687 0.201756
C  -4.024741 -0.877062 0.377209
H  1.794954 -0.406865 1.76161
H  3.068189 0.169478 -0.197387
H  0.89894 -2.807007 1.028309
H  2.982087 -2.92513 -0.032055
H  4.347836 -1.929362 -0.582527
H  3.853546 -1.865674 1.138341
H  -0.458096 3.59704 -0.490355
H  -2.692807 2.53717 -0.797428
H  1.392676 -0.361947 -1.852779
H  1.402889 4.259856 0.87545
H  1.868965 3.964316 -0.848585
H  3.104109 3.823763 0.458956
H  -4.006696 -0.54893 1.434514
H  -3.514303 -1.847837 0.272009
H  -5.063459 -0.922451 0.016729
