program: Gaussian 09
title: 000288700
version: EM64L-G09RevD.01
frameworkgroup: C1[X(C11H18)]
method: RPBEPBE
basis: SDD
operation: Freq
keyword: #p
keyword: freq=noraman
keyword: PBEPBE/SDD
title: #p freq=noraman PBEPBE/SDD
converged: YES YES NO NO
title: Mulliken charges:
elementType: C C C C C C C C C C C H H H H H H H H H H H H H H H H H H
charge: 0.291423 -0.577235 -0.458862 0.447704 -0.724444 -0.748001 0.485047 -0.563094 -0.541193 -0.840883 -0.684340 0.204439 0.218373 0.231809 0.201146 0.212285 0.235787 0.219084 0.208568 0.208336 0.228235 0.207419 0.203375 0.224725 0.223348 0.229474 0.214724 0.223414 0.219337
chargesum: 0.00000
title: Mulliken charges with hydrogens summed into heavy atoms:
elementType: C C C C C C C C C C C
charge: 0.291423 -0.154424 -0.227053 0.447704 -0.075226 -0.112013 0.485047 -0.334860 -0.130399 -0.163335 -0.026865
polarizability: 1.36812419e+02 -1.17546778e+00 1.27981098e+02 -1.16146574e+00 2.00996918e+00 8.95015917e+01
1716.lowfreq: -4.8695 -0.0005 -0.0002 0.0007 9.7027 11.9221 61.8607 96.4877 110.4278
frequency: 61.7688 96.4785 110.4274 147.6034 189.5721 191.5681 225.9989 241.7731 252.2574 279.8487 286.5982 312.8273 333.2397 423.1603 447.2178 458.2630 483.5649 497.6882 549.9496 631.3509 776.3446 792.4375 828.3406 848.6675 868.9540 890.6622 911.9592 923.9574 934.5919 975.8289 979.0633 1002.0829 1020.9165 1033.3793 1058.3778 1075.6908 1126.7880 1151.5443 1156.5050 1225.1941 1243.6187 1245.9523 1277.4756 1281.4214 1314.7277 1347.4876 1368.5426 1373.9551 1387.4307 1391.2062 1393.8921 1440.6298 1458.0724 1462.6694 1466.3932 1468.2422 1469.8713 1473.7709 1477.3005 1484.0980 1487.2140 1621.8617 1671.7068 2924.3407 2951.4736 2963.8806 2967.6186 2969.7901 2978.5170 3001.1016 3019.1852 3029.6403 3057.6640 3063.8636 3067.6427 3073.8669 3074.9797 3078.2779 3081.1328 3091.6363 3103.4203
redmass: 2.3860 2.4465 2.7659 2.1173 1.3923 1.1451 1.0501 1.9804 1.3857 1.4721 2.2827 2.1893 2.4004 2.4496 2.8706 2.3682 3.4401 3.8722 3.3464 2.4407 1.6556 1.8554 1.4339 1.8613 2.0516 1.8377 2.9114 1.7229 1.6542 1.9629 1.6289 1.3077 1.8554 1.4739 2.0253 1.4918 1.7315 1.5938 2.0184 1.9323 1.2584 3.1886 1.4900 1.8521 1.5528 1.9073 1.2260 1.9622 1.1967 1.2967 1.2483 1.0825 1.0489 1.0492 1.0558 1.0737 1.0737 1.0447 1.0537 1.0629 1.0742 7.6330 6.6120 1.0649 1.0379 1.0349 1.0364 1.0603 1.0356 1.0930 1.0961 1.0988 1.0990 1.0988 1.0997 1.0995 1.0978 1.0999 1.1009 1.0911 1.0909
irintensity: 0.0955 0.1320 1.2503 1.6430 0.1171 0.1269 0.0364 0.5273 0.6225 0.0945 0.7719 0.3328 0.1752 1.5738 0.8620 0.9884 0.9585 1.1440 0.9276 10.9265 1.7155 2.7457 19.1932 10.9541 5.2544 1.7249 5.1452 6.8213 8.2794 3.8225 3.1431 2.5496 2.2611 3.6704 9.0117 0.3624 3.1929 2.2877 8.2720 3.8362 1.5700 2.6243 1.8121 5.0517 1.5103 16.3083 21.9922 1.5484 13.1540 10.6556 9.2792 6.4096 14.9619 0.9418 5.7127 6.6901 13.2849 11.1570 8.7831 16.2834 10.3029 7.8559 15.4544 35.7868 54.8487 31.1808 56.0281 35.6166 35.4587 27.3293 26.1984 11.7521 5.7318 57.3822 38.7086 57.8611 30.5667 26.6587 37.4128 35.8094 26.0880
temp: 298.150 k
press: 1.00000 atm
elementType: 6 6 6 6 6 6 6 6 6 6 6 1 1 1 1 1 1 1 1 1 1 1 1 1 1 1 1 1 1
symmnumber: 1
zpe: 675339.9 jmol-1
zpe.correction: 0.257223 hartree
zpe.thermalcorrener: 0.269956 hartree
zpe.thermalcorrenthalpy: 0.270900 hartree
zpe.thermalcorrgfe: 0.219445 hartree
zpe.sumelectzpe: -429.080893 hartree
zpe.sumelectthermal: -429.068160 hartree
zpe.sumelectthermalent: -429.067215 hartree
zpe.sumelectthermalfe: -429.118671 hartree
dipole: -0.3507 0.3480 0.0415
dipole: 0.4958
quadrupole: -66.2986 -66.4928 -71.9000
quadrupole: -0.8514 -0.3915 0.2809
quadrupole: 1.9319 1.7376 -3.6695 -0.8514 -0.3915 0.2809
hfenergy: -429.338116 hartree
pointgroup: C01 [X(C11H18)]
dipole: -0.1454413 0.1279002 0.0232333 debye
polarizability: 136.9450812|-0.7125636|127.3558104|-0.3362265|4.8588746|89.9942168 unknown
InChI: InChI=1S/C11H18/c1-5-10-6-9(2)7-11(3,4)8-10/h6,8H,5,7H2,1-4H3
charge 0 multiplicity 1
29 atoms
C  -1.231267 -1.002631 -0.038855
C  -1.666866 0.453925 -0.376943
C  0.243935 -1.194033 -0.400934
C  -0.645959 1.517025 0.016209
C  -1.393145 -1.262521 1.490782
C  -2.11669 -2.003625 -0.823265
C  1.148993 -0.168129 -0.344501
C  0.682969 1.1917 0.002655
C  2.636199 -0.378499 -0.592636
C  -1.160517 2.90632 0.314149
C  3.487163 -0.252879 0.699517
H  -2.645159 0.662792 0.101741
H  -1.836703 0.537128 -1.474934
H  0.579311 -2.214656 -0.636238
H  -2.45657 -1.179458 1.79042
H  -1.038449 -2.275896 1.754371
H  -0.806543 -0.530619 2.074349
H  -1.99569 -1.869438 -1.914294
H  -1.846298 -3.047835 -0.57626
H  -3.186123 -1.863682 -0.575262
H  1.435815 1.961521 0.221614
H  2.799462 -1.378468 -1.037526
H  3.00055 0.364085 -1.331901
H  -1.80748 2.908971 1.214741
H  -1.786542 3.285766 -0.519168
H  -0.339035 3.625102 0.480139
H  4.562089 -0.389122 0.479203
H  3.184827 -1.015194 1.440009
H  3.36222 0.73965 1.170016
