program: Gaussian 09
title: 000288718
version: EM64L-G09RevD.01
frameworkgroup: C1[X(C9H14N4O4)]
method: RPBEPBE
basis: SDD
operation: Freq
keyword: #p
keyword: freq=noraman
keyword: PBEPBE/SDD
title: #p freq=noraman PBEPBE/SDD
converged: NO YES NO NO
title: Mulliken charges:
elementType: O O O O N N N N C C C C C C C C C H H H H H H H H H H H H H H
charge: -0.274927 -0.454569 -0.448462 -0.338695 -0.180674 -0.101844 -0.635955 -0.622563 -0.131807 -0.088305 -0.510064 -0.019702 -0.430544 0.304541 -0.251194 -0.104196 0.193435 0.277154 0.237322 0.264455 0.251856 0.237901 0.232556 0.229424 0.350910 0.296351 0.353205 0.328956 0.368522 0.343419 0.323494
chargesum: 0.00000
title: Mulliken charges with hydrogens summed into heavy atoms:
elementType: O O O O N N N N C C C C C C C C C
charge: -0.274927 -0.103658 -0.095256 -0.338695 -0.180674 -0.101844 0.061522 0.044351 0.145347 0.149017 0.006247 0.218198 0.031435 0.304541 0.045157 -0.104196 0.193435
polarizability: 1.75542891e+02 -5.16137559e-01 1.33863549e+02 -1.47063939e+01 1.02019032e+01 1.02172397e+02
1716.lowfreq: -9.9605 -4.6631 -0.0007 -0.0004 0.0001 3.9252 21.7819 31.5552 41.1933
frequency: 20.0195 31.4825 41.1379 85.0520 104.5230 120.7242 127.3852 156.5774 198.9173 228.1650 248.4439 262.0668 291.3666 315.5642 323.7259 360.7450 387.8204 427.2681 441.8078 450.3385 470.4241 511.8965 518.4220 553.5765 593.7100 615.1579 621.9912 643.7549 665.8674 705.0270 716.8352 731.7355 753.6835 769.7509 779.6618 824.7666 872.2211 902.3464 943.1454 947.4045 963.8945 980.1950 1026.2711 1043.3039 1044.8093 1051.0785 1122.8657 1139.3954 1145.3132 1160.7672 1172.7390 1200.3867 1218.7556 1248.9121 1263.9743 1276.7078 1286.8222 1303.5500 1306.8173 1316.1195 1344.0713 1367.6351 1374.2917 1381.9251 1414.0509 1440.3887 1470.8246 1474.1293 1477.5825 1550.3701 1580.4700 1617.4456 1642.3220 2965.5705 2996.1691 3009.0210 3050.6405 3064.0381 3094.3214 3119.1551 3244.9751 3402.7302 3513.7878 3545.7481 3579.4222 3612.9268 3682.0370
redmass: 6.0928 5.1906 5.1922 5.2505 5.5819 6.8620 5.1517 4.3550 4.3085 4.2600 1.1488 3.7283 4.9987 3.4563 3.7090 3.3035 3.4959 1.1484 5.1660 1.5310 2.2003 4.1110 1.2302 3.9931 4.3577 1.5482 2.0202 4.1489 5.4736 3.3626 1.7643 4.8037 1.4266 3.9367 4.9143 2.5066 3.8456 2.6067 3.7601 4.8968 3.5135 3.0161 2.1652 1.8173 2.9526 1.8908 1.6445 2.2076 1.7996 2.3266 1.7030 2.2065 1.2121 2.7005 1.4026 1.2889 1.9477 1.3069 1.5044 1.2959 1.2687 1.3852 1.4177 1.5365 4.7038 4.0291 1.1328 1.0836 3.7738 2.4589 1.3717 2.0709 4.1445 1.0836 1.0865 1.0622 1.0692 1.0818 1.1042 1.1035 1.0989 1.0532 1.0449 1.0657 1.0668 1.0951 1.1043
irintensity: 0.5197 1.8816 0.6423 8.5353 9.4591 12.1978 3.0128 6.9237 13.0805 12.5145 181.6107 1.6818 7.3303 3.0504 2.6523 7.2626 5.5754 142.1989 2.5710 98.3068 97.2581 16.7902 185.0710 3.0948 5.4898 60.4350 24.9528 5.4331 29.8962 54.9849 131.6205 13.0395 111.7849 14.1788 20.1749 8.5117 95.9427 36.1202 11.6393 50.6234 44.4954 107.5240 20.4150 19.0409 21.1022 7.0133 6.3620 2.5413 1.8378 6.9314 44.3107 3.9596 58.2965 219.2109 7.5649 0.6443 41.1432 13.8634 22.0469 5.0951 15.9859 13.5103 1.7132 1.7648 25.4836 4.1003 24.0263 4.3756 104.5144 307.8708 187.7131 108.2691 410.4950 20.3590 47.9659 37.3845 5.1945 24.4244 23.7367 9.2520 5.7861 94.6219 52.2725 13.9083 12.6082 59.9027 52.2452
temp: 298.150 k
press: 1.00000 atm
elementType: 8 8 8 8 7 7 7 7 6 6 6 6 6 6 6 6 6 1 1 1 1 1 1 1 1 1 1 1 1 1 1
symmnumber: 1
zpe: 640320.6 jmol-1
zpe.correction: 0.243885 hartree
zpe.thermalcorrener: 0.260547 hartree
zpe.thermalcorrenthalpy: 0.261492 hartree
zpe.thermalcorrgfe: 0.198286 hartree
zpe.sumelectzpe: -869.960141 hartree
zpe.sumelectthermal: -869.943479 hartree
zpe.sumelectthermalent: -869.942535 hartree
zpe.sumelectthermalfe: -870.005740 hartree
dipole: 4.6229 -0.4560 0.5686
dipole: 4.6800
quadrupole: -107.9813 -101.7043 -89.0893
quadrupole: -9.7874 -1.3927 3.1066
quadrupole: -8.3897 -2.1127 10.5024 -9.7874 -1.3927 3.1066
hfenergy: -870.2040263 hartree
pointgroup: C01 [X(C9H14N4O4)]
dipole: -1.8381343 0.0512164 0.0940881 debye
polarizability: 172.7607232|0.4078637|135.6788847|20.7822126|-5.4009432|103.1392297 unknown
InChI: InChI=1S/C9H14N4O4/c10-8-7(9(11)16)12-3-13(8)6-1-4(15)5(2-14)17-6/h3-6,14-15H,1-2,10-11H2
charge 0 multiplicity 1
31 atoms
O  -1.70937 1.374081 -0.469258
O  -2.811853 -2.064412 -0.568152
O  -4.570396 -0.126093 1.426297
O  3.973295 1.440713 0.805862
N  0.284646 0.03191 -0.816274
N  1.788672 -1.459463 0.021217
N  1.471081 2.156627 -0.428329
N  4.347553 -0.842912 1.197531
C  -0.881221 0.639668 -1.462472
C  -2.908893 -0.662485 -0.981579
C  -1.856491 -0.381136 -2.087347
C  -2.537881 0.322346 0.169877
C  -3.748711 0.961566 0.847342
C  1.371111 0.786139 -0.347397
C  0.584875 -1.332319 -0.543445
C  2.299968 -0.147019 0.149431
C  3.590277 0.21324 0.733728
H  -0.525523 1.413994 -2.16243
H  -3.932765 -0.446284 -1.345484
H  -1.372599 -1.314776 -2.411709
H  -2.329661 0.081747 -2.9672
H  -1.922031 -0.230387 0.912202
H  -4.394063 1.462789 0.107753
H  -3.444197 1.697916 1.615183
H  -3.522331 -2.22519 0.105548
H  -0.120253 -2.135205 -0.740624
H  -4.234304 -0.341094 2.332089
H  0.634093 2.737054 -0.384379
H  2.361948 2.51008 -0.05233
H  3.980986 -1.791082 1.106019
H  5.259439 -0.664515 1.611627
