program: Gaussian 09
title: 000288721
version: EM64L-G09RevD.01
frameworkgroup: C1[X(C11H14N4O5)]
method: RPBEPBE
basis: SDD
operation: Freq
keyword: #p
keyword: freq=noraman
keyword: PBEPBE/SDD
title: #p freq=noraman PBEPBE/SDD
converged: NO YES NO NO
title: Mulliken charges:
elementType: O O O O O N N N N C C C C C C C C C C C H H H H H H H H H H H H H H
charge: -0.234973 -0.445084 -0.455447 -0.442383 -0.246949 -0.154165 -0.171271 -0.178428 -0.499355 -0.130139 -0.159758 -0.221405 -0.032432 -0.378782 0.154594 -0.147663 0.106258 -0.373864 0.124969 -0.145413 0.269215 0.259670 0.259035 0.243933 0.233492 0.197164 0.262129 0.349860 0.389385 0.275072 0.364171 0.284362 0.321525 0.322678
chargesum: 0.00000
title: Mulliken charges with hydrogens summed into heavy atoms:
elementType: O O O O O N N N N C C C C C C C C C C C
charge: -0.234973 -0.095224 -0.066062 -0.078211 -0.246949 -0.154165 -0.171271 -0.178428 0.144847 0.139077 0.099911 0.037629 0.211501 0.051874 0.154594 0.114466 0.106258 -0.098792 0.124969 0.138950
polarizability: 2.09519114e+02 -1.31239881e+01 1.71941539e+02 -7.48427798e+00 -1.51598291e+01 1.08014216e+02
1716.lowfreq: -7.2637 -0.0009 -0.0006 -0.0001 3.8845 8.5033 32.0004 41.1967 57.8079
frequency: 31.9517 41.1869 57.7920 88.1595 97.7229 107.6841 132.5777 142.4710 158.6286 204.7123 232.0967 260.0888 266.5460 276.4587 298.1269 302.6168 316.3689 327.9745 346.4115 372.9682 377.7963 430.5717 447.3226 462.3552 520.1861 543.0708 563.1758 600.9826 616.1494 625.5647 666.0793 672.1826 734.6522 738.5169 760.1622 781.4319 804.8580 817.3511 850.2822 865.0488 882.5128 899.8831 906.8733 918.6587 948.6944 972.9621 987.7565 993.6585 1025.2662 1029.8612 1038.9926 1058.8635 1076.5405 1129.5606 1132.0404 1158.6414 1172.3966 1194.4703 1212.4874 1239.6820 1251.5252 1266.9523 1278.1417 1283.1127 1288.3342 1298.3859 1305.8848 1318.1287 1322.1990 1346.8756 1358.3622 1383.4431 1390.2484 1414.7476 1458.5751 1467.9965 1478.4698 1486.2820 1516.4368 1535.0896 1659.2933 1684.5772 2969.7095 2991.5028 3017.7438 3026.9955 3073.7074 3086.8855 3096.1019 3190.7613 3224.4945 3249.7037 3386.6816 3500.7393 3513.7474 3570.9452
redmass: 6.4558 5.7837 6.3262 5.7569 1.9152 4.9835 5.8979 2.1099 3.5652 4.3030 5.0408 4.2576 4.8307 4.6411 3.2173 1.4371 4.5678 1.4860 3.6169 4.2109 4.0176 6.0763 3.5335 6.8285 4.8568 5.1281 4.7817 5.6599 4.5678 5.6296 8.0772 7.4800 1.9167 5.5682 6.2338 2.8534 3.4434 1.1110 2.2969 2.0831 1.3803 1.3634 5.6080 4.9190 3.8136 5.4188 3.6273 4.3523 4.0472 3.4414 4.8443 1.5797 2.3126 2.6027 3.3861 1.1748 1.2353 1.7970 3.2119 1.3038 1.1987 1.3035 1.3207 1.3012 1.1981 1.7683 2.2650 2.2103 1.3509 1.9046 1.4259 1.3018 1.9162 2.6934 2.1617 5.7521 1.8679 1.1036 5.0431 5.8902 2.9939 1.5115 1.0699 1.0816 1.0856 1.0823 1.0718 1.0970 1.0876 1.0948 1.0919 1.1070 1.0436 1.0977 1.0668 1.0663
irintensity: 0.4932 1.9021 4.6755 16.0789 36.0417 1.6627 1.4106 8.3534 11.6301 4.6823 6.3611 6.4801 1.2322 3.0298 32.5149 108.2410 25.5808 111.2322 59.3686 25.3616 8.2352 5.9491 11.7469 3.2395 2.9894 4.5653 2.2840 5.6286 10.0625 10.6480 11.3848 14.6435 54.3532 13.7828 121.7861 29.4893 100.7250 96.2011 48.7022 15.8312 1.4019 9.3091 38.7977 7.1271 56.5050 77.6570 108.1998 31.4817 5.1561 38.5516 29.8487 10.9466 5.9743 1.2188 42.4155 34.4947 42.4699 41.6995 85.3856 31.0903 8.8278 16.9724 3.4423 3.6847 2.0521 17.5466 57.5854 22.1241 19.9244 18.3139 1.7152 25.4539 52.1668 17.8484 36.1432 44.6228 22.4609 4.5940 6.8863 110.6957 247.7821 294.0738 34.6335 37.2669 9.9583 315.7669 536.6108 34.7133 8.4775 1.9419 1.4663 0.7144 10.1350 10.4168 11.1919 13.8844
temp: 298.150 k
press: 1.00000 atm
elementType: 8 8 8 8 8 7 7 7 7 6 6 6 6 6 6 6 6 6 6 6 1 1 1 1 1 1 1 1 1 1 1 1 1 1
symmnumber: 1
zpe: 679555.9 jmol-1
zpe.correction: 0.258829 hartree
zpe.thermalcorrener: 0.277081 hartree
zpe.thermalcorrenthalpy: 0.278025 hartree
zpe.thermalcorrgfe: 0.212328 hartree
zpe.sumelectzpe: -1021.151077 hartree
zpe.sumelectthermal: -1021.132826 hartree
zpe.sumelectthermalent: -1021.131881 hartree
zpe.sumelectthermalfe: -1021.197578 hartree
dipole: 1.6925 0.6891 2.6245
dipole: 3.1980
quadrupole: -125.9585 -117.8783 -117.3915
quadrupole: -14.1608 -5.4597 -3.1386
quadrupole: -5.5491 2.5312 3.0179 -14.1608 -5.4597 -3.1386
hfenergy: -1021.4099061 hartree
pointgroup: C01 [X(C11H14N4O5)]
dipole: -0.6929643 0.1927073 -1.0323244 debye
polarizability: 206.6759076|16.3073433|175.1092708|-9.5586093|13.3326803|107.6896902 unknown
InChI: InChI=1S/C11H14N4O5/c12-15-4-13-9-5(10(15)19)1-2-14(9)11-8(18)7(17)6(3-16)20-11/h1-2,4,6-8,11,16-18H,3,12H2
charge 0 multiplicity 1
34 atoms
O  2.14073 1.180612 1.047441
O  2.851873 1.762014 -1.957926
O  2.066286 -1.695533 -1.167315
O  3.947562 -2.068756 1.560828
O  -4.50639 -0.234341 0.631045
N  -0.105231 1.428666 0.102773
N  -0.510946 -0.960109 -0.493919
N  -2.787712 -1.640189 -0.164591
N  -3.694098 -2.742241 -0.268089
C  1.353052 1.608181 -0.108923
C  1.912067 0.831865 -1.322963
C  2.61097 -0.428966 -0.708995
C  2.475314 -0.251288 0.837768
C  3.746385 -0.613641 1.60943
C  -0.90554 0.290854 -0.037941
C  -0.91552 2.46636 0.609007
C  -2.228248 0.636704 0.366261
C  -2.220985 2.012579 0.773935
C  -3.287704 -0.347871 0.32176
C  -1.47801 -1.876798 -0.538444
H  1.529461 2.688036 -0.227603
H  1.124799 0.524763 -2.037526
H  3.676115 -0.425578 -1.003471
H  1.642555 -0.886322 1.203745
H  3.647583 -0.36095 2.677472
H  4.617361 -0.068148 1.190184
H  -0.48113 3.443316 0.812151
H  3.295327 1.305392 -2.716692
H  1.069521 -1.622289 -0.972648
H  -3.071218 2.583462 1.138918
H  3.723626 -2.402205 0.651595
H  -1.26998 -2.89205 -0.882547
H  -4.049676 -2.975467 0.671985
H  -4.481392 -2.470063 -0.876604
