program: Gaussian 09
title: 000288682
version: EM64L-G09RevD.01
frameworkgroup: C1[X(C7H9N3O)]
method: RPBEPBE
basis: SDD
operation: Freq
keyword: #pfreq=noraman
keyword: PBEPBE/SDD
title: #p freq=noraman PBEPBE/SDD
converged: YES YES NO NO
title: Mulliken charges:
elementType: O N N N C C C C C C C H H H H H H H H H
charge: -0.291314 -0.478873 -0.420725 -0.021492 0.490926 -0.373657 -0.281840 0.311966 -0.309387 -0.338951 -0.602267 0.288379 0.215234 0.304279 0.293240 0.237798 0.239120 0.282653 0.227072 0.227837
chargesum: 0.00000
title: Mulliken charges with hydrogens summed into heavy atoms:
elementType: O N N N C C C C C C C
charge: -0.291314 -0.190494 -0.127485 -0.021492 0.490926 -0.158423 0.022440 0.311966 -0.071588 -0.099831 0.135296
polarizability: 1.56765712e+02 -3.97963462e+00 1.01296643e+02 2.44480998e-02 1.14076629e-02 4.64686456e+01
1716.lowfreq: 0.0006 0.0009 0.0010 3.1428 11.2001 20.6694 48.7714 67.7577 109.2639
frequency: 48.6370 67.7528 109.2552 136.2587 149.8080 230.1547 288.8391 324.3969 367.7848 377.5032 398.7501 534.5862 595.4606 602.5949 658.1807 707.2282 715.2060 739.3328 824.7281 841.6765 876.7966 935.0108 950.8799 956.7868 984.9729 1056.9832 1088.8588 1105.9304 1127.6943 1135.0262 1214.1190 1220.4150 1275.1420 1322.8330 1333.0804 1404.5497 1424.9815 1457.0260 1465.7323 1487.5129 1488.6176 1518.5648 1577.1615 1589.8421 1655.8992 2978.8382 3057.5994 3111.8815 3113.8204 3134.8285 3142.3121 3203.1971 3520.4917 3557.5788
redmass: 3.4168 3.8739 1.1937 4.2976 3.1587 3.8400 4.6746 5.4992 5.7517 2.5416 1.3307 2.6288 6.5758 1.2277 6.8197 11.1422 4.8152 3.3874 1.5256 5.3726 1.2657 4.2409 1.4030 6.8146 1.3789 2.1216 1.5655 4.5805 1.2776 1.5530 1.7662 1.3980 2.3877 3.8296 1.6309 2.0853 1.1601 1.3910 1.7524 1.1182 2.2277 1.4860 4.3233 5.3819 4.6230 1.0353 1.1029 1.0977 1.0879 1.0907 1.0977 1.0950 1.0762 1.0773
irintensity: 5.3090 2.2535 1.1393 1.4416 5.5384 0.5971 9.4370 1.2397 19.1763 0.2125 22.0966 83.2467 5.9779 140.4993 2.2793 14.3335 2.9612 0.3159 88.6638 6.5172 8.6617 6.2303 1.7959 8.6915 3.1123 0.2220 6.6226 13.8203 0.3740 43.2769 296.6272 21.8266 15.7489 90.2778 10.9987 43.4962 27.9696 101.2009 40.6725 41.2530 252.9649 362.5662 134.9349 141.7848 180.9762 91.0355 40.2604 1.4140 11.7119 42.6256 14.4469 6.1171 4.7402 23.7345
temp: 298.150 k
press: 1.00000 atm
elementType: 8 7 7 7 6 6 6 6 6 6 6 1 1 1 1 1 1 1 1 1
symmnumber: 1
zpe: 413866.6 jmol-1
zpe.correction: 0.157633 hartree
zpe.thermalcorrener: 0.168030 hartree
zpe.thermalcorrenthalpy: 0.168974 hartree
zpe.thermalcorrgfe: 0.120940 hartree
zpe.sumelectzpe: -510.826402 hartree
zpe.sumelectthermal: -510.816005 hartree
zpe.sumelectthermalent: -510.815061 hartree
zpe.sumelectthermalfe: -510.863095 hartree
dipole: 4.7680 -4.8428 0.0045
dipole: 6.7960
quadrupole: -67.0685 -56.8291 -68.1784
quadrupole: -4.5638 0.0163 0.0025
quadrupole: -3.0431 7.1962 -4.1531 -4.5638 0.0163 0.0025
hfenergy: -510.984035 hartree
pointgroup: C01 [X(C7H9N3O1)]
dipole: 1.8515967 -1.9262048 0.1018601 debye
dipolederiv: -0.7978897 0.0089965 -0.0033902 -0.0897414 -0.9478712 0.0271243 0.0018625 0.0269099 -0.3751878 -2.1837263 -0.0466571 -0.0086272 -0.3584264 -0.2958328 -0.005917 0.0052285 -0.0040354 -0.3633672 -1.4994895 0.2362516 -0.0195611 0.3825594 -0.4038474 -0.0053385 -0.0195432 -0.0070971 -0.5489263 -0.5650604 -0.0039152 -0.0015459 -0.0233519 -0.4807212 0.0106633 -0.0003795 0.0107834 -0.2479139 1.6491361 -0.1617176 0.0153137 -0.5250518 0.1990223 -0.0057014 0.0320548 -0.0034638 0.1374729 -0.6152004 -0.032138 -0.0008875 -0.1619063 0.0054167 -0.009764 0.0054615 -0.0091831 -0.1848582 -0.4728267 0.1439311 -0.0084512 0.3891896 -0.2106987 0.0059406 -0.0194685 0.0045347 -0.130905 2.6237486 -0.1488471 0.0231455 0.2679785 1.2841009 -0.0449026 0.0042991 -0.0470707 0.3174723 0.4221489 0.0842865 -0.0014755 0.0106948 0.3035161 -0.017883 0.0018713 -0.0174688 -0.084002 0.4135809 -0.109485 0.0074845 -0.026043 0.3834773 -0.0218047 0.0033508 -0.0220382 -0.0832537 0.5813633 0.0402404 0.0040682 0.327942 0.0042337 0.0192444 -0.0135834 0.0183263 0.281436 0.111151 -0.005794 -0.0009409 0.0038568 0.0660855 0.0117017 -0.0016761 0.0119841 0.3147857 0.0555975 0.1052896 -0.0054126 0.0615075 -0.1088893 0.0134178 -0.0033666 0.0137263 0.1728664 0.1633594 -0.0663064 0.003072 -0.0484659 0.0807888 0.0043389 0.0021545 0.0042362 0.1816712 0.1149969 -0.0558794 0.0009124 -0.0955234 0.0719411 0.0137049 0.0020788 0.0147852 0.3676537 -0.0142555 -0.1166194 0.0046701 -0.1110529 -0.0421547 0.007734 0.0043784 0.0076483 0.1361117 0.0704107 0.0479397 -0.0025094 0.0460021 -0.1104387 0.0114559 -0.0023439 0.0113522 0.1322903 0.1825554 0.0616367 -0.0049257 -0.0575731 -0.0050778 0.0097897 0.0015966 0.0100758 0.1357055 -0.1216905 0.0154184 0.0839379 0.0165068 0.0958161 -0.0852692 0.1585503 -0.0672743 -0.067131 -0.1179097 0.0033686 -0.0848771 -0.0091014 0.1111334 0.0614649 -0.1625259 0.0432689 -0.0919205 unknown
polarizability: 156.6523639|-4.6442382|101.2863279|0.8693066|-2.5626165|46.5923089 unknown
InChI: InChI=1S/C7H9N3O/c1-8-7(11)10-6-2-4-9-5-3-6/h2-5,8,10H,1H3
charge 0 multiplicity 1
20 atoms
O  1.876908 1.302617 -0.05949
N  0.733384 -0.767547 0.029824
N  3.075633 -0.70232 0.043283
N  -3.389971 0.372671 -0.041947
C  -0.612063 -0.33842 0.003484
C  -1.631395 -1.331003 0.044742
C  -1.013189 1.023875 -0.061319
C  1.895104 0.038385 0.000275
C  -2.981446 -0.931129 0.020334
C  -2.394592 1.310838 -0.080918
C  4.385006 -0.041987 0.023023
H  0.862663 -1.78078 0.078091
H  -1.379764 -2.397783 0.095568
H  -0.266426 1.81775 -0.093834
H  3.048458 -1.721248 0.091855
H  -3.779412 -1.681961 0.05133
H  -2.729452 2.353378 -0.130313
H  4.205879 1.042381 -0.050478
H  4.984588 -0.363419 -0.848641
H  4.955086 -0.245297 0.94863
