program: Gaussian 09
title: 000288813
version: EM64L-G09RevD.01
frameworkgroup: C1[X(C25H27NO)]
method: RPBEPBE
basis: SDD
operation: Freq
keyword: #p
keyword: freq=noraman
keyword: PBEPBE/SDD
title: #p freq=noraman PBEPBE/SDD
converged: NO YES NO NO
title: Mulliken charges:
elementType: O N C C C C C C C C C C C C C C C C C C C C C C C C C H H H H H H H H H H H H H H H H H H H H H H H H H H H
charge: -0.451963 -0.105535 -0.184119 -0.575225 -0.398683 0.174815 -0.487516 -0.537952 0.277792 0.421313 0.262896 0.373959 -0.723892 -0.381213 -0.395061 -0.391044 -0.421721 -0.391518 -0.411974 -0.249866 -0.246299 -0.236215 -0.249887 -0.238735 -0.247991 -0.222272 -0.247316 0.244329 0.227260 0.211425 0.226434 0.180121 0.196850 0.257088 0.232698 0.206714 0.222776 0.209112 0.243827 0.230080 0.230822 0.242894 0.259584 0.347370 0.226155 0.274550 0.225626 0.225338 0.226408 0.228806 0.230032 0.225978 0.225382 0.227565
chargesum: 0.00000
title: Mulliken charges with hydrogens summed into heavy atoms:
elementType: O N C C C C C C C C C C C C C C C C C C C C C C C C C
charge: -0.104592 -0.105535 0.060210 -0.136541 0.007872 0.174815 -0.033578 -0.098540 0.277792 0.421313 0.262896 0.373959 -0.048177 -0.151133 -0.164240 -0.148150 -0.162137 -0.165364 -0.137424 -0.024239 -0.020961 -0.009806 -0.021082 -0.008703 -0.022013 0.003110 -0.019750
polarizability: 2.88975694e+02 -6.00388471e+00 2.87016469e+02 2.33511604e+01 2.36985708e+01 2.27574824e+02
1716.lowfreq: -6.8437 0.0005 0.0006 0.0008 3.6484 9.1578 16.3448 28.6515 31.8368
frequency: 15.6878 28.5240 31.8120 40.3322 47.4653 53.9962 69.2059 101.1475 107.3119 143.7307 163.8364 174.3375 206.8523 213.1818 218.0274 247.0128 251.0240 254.8138 279.7299 310.7113 342.4407 349.4915 379.3542 384.9293 397.4011 405.3449 416.2860 425.7525 436.3712 462.1672 481.1002 491.8794 504.0290 528.2306 566.8597 574.2673 588.8378 608.4711 616.1301 618.3274 661.9227 706.5358 709.7614 711.2789 716.5173 731.2302 745.2496 754.9717 772.0750 773.2722 808.3035 849.2151 858.2902 861.0152 862.1605 867.4211 924.1361 929.3150 931.3683 932.2759 940.5378 959.2360 982.5528 983.8790 984.1063 986.5378 989.2405 992.0235 995.5187 999.8476 1002.2327 1006.5807 1024.7408 1031.1013 1036.7612 1052.8862 1055.5347 1067.2708 1080.0084 1087.5413 1097.8575 1126.3788 1134.5380 1146.7638 1170.2134 1172.9079 1173.5655 1179.6033 1187.6837 1190.9105 1194.9874 1199.4380 1200.7742 1219.8366 1232.5245 1251.8147 1267.4012 1275.9357 1290.9318 1311.7914 1312.6174 1325.1126 1338.3642 1342.7635 1349.6640 1364.9644 1376.6238 1377.8493 1384.9425 1386.8656 1390.5571 1431.4524 1437.7800 1441.8823 1445.2991 1452.6324 1463.9374 1466.5031 1471.0563 1479.0427 1479.6102 1485.0787 1491.7486 1588.4182 1589.5703 1594.9982 1609.4466 1610.5410 1616.5175 2818.9470 2844.7657 2976.6914 2987.0793 2989.9944 3001.0795 3014.9817 3029.9899 3035.4018 3052.5425 3092.1325 3100.2011 3108.9647 3113.2818 3113.7815 3123.2559 3125.1287 3128.9267 3135.2843 3137.5185 3141.2853 3150.5029 3154.4592 3158.0308 3165.2346 3166.3918 3500.3073
redmass: 5.1721 4.5307 4.4393 4.3523 3.8614 3.9835 4.7450 3.6417 4.1171 2.9063 4.1547 4.5814 4.4899 3.1224 1.1062 3.2589 3.0878 3.0130 2.9723 3.7064 2.8865 3.4464 1.5610 2.7241 3.3064 2.8578 1.9753 2.8572 3.5270 3.5553 3.5818 2.6924 3.6863 3.8828 3.8971 3.4194 4.3163 4.1480 6.4011 5.9164 3.6014 1.9379 3.1934 1.9075 3.5269 3.7801 1.5880 1.6576 2.2023 2.2679 2.5769 3.4557 1.4719 1.5002 1.8417 1.3281 1.9912 1.4277 2.2107 1.4478 1.3972 1.9135 1.6624 1.3949 1.3354 2.3475 5.4077 3.5330 2.0392 1.3270 1.3627 2.4816 2.4629 2.2187 2.3029 2.5298 2.3356 1.6695 1.6005 2.4829 1.9245 1.7174 1.8077 3.1068 1.0890 1.0631 1.0721 1.5980 1.1239 1.2264 1.1543 2.3922 2.1008 1.6472 1.6469 1.9748 1.5094 1.3608 1.4307 1.4460 1.3882 1.4145 1.5541 1.4551 1.3828 1.6200 1.8650 6.4923 1.2231 3.8587 3.2067 2.2132 2.0991 2.2574 1.1482 1.0823 1.1000 1.1251 1.1811 1.2063 1.5861 2.0776 2.3293 6.1340 5.8235 6.7615 6.0789 6.0102 6.4713 1.0708 1.0704 1.0599 1.0814 1.0359 1.0604 1.0849 1.0960 1.0934 1.0991 1.1004 1.1000 1.0866 1.0892 1.0856 1.0849 1.0870 1.0874 1.0925 1.0932 1.0920 1.0957 1.0959 1.1004 1.1014 1.0983 1.0659
irintensity: 0.1599 0.0137 0.1156 0.1165 0.3861 0.1124 0.2075 0.3338 0.0562 0.3648 0.4320 0.3369 0.3022 0.3640 0.3226 3.0806 3.6990 5.0063 3.5148 5.1436 2.9167 3.7361 105.7456 16.8869 7.2482 0.5777 58.9039 8.4194 13.9055 3.8158 1.1549 10.5873 2.0221 15.2052 5.2179 19.0463 2.7736 1.7635 0.1467 0.5205 3.5989 35.6547 4.5620 52.6667 8.9414 10.0887 55.4411 47.2939 18.5681 42.9046 2.7304 7.7415 1.9785 4.1941 7.1027 0.5014 4.6816 7.2557 18.2989 4.8583 2.1511 9.9278 0.7554 0.3152 0.2773 0.1700 0.1249 2.4254 0.2170 0.2471 1.2206 14.0987 7.9515 14.2522 6.5411 8.3959 33.4933 14.9052 13.2840 65.3249 3.8498 11.0235 18.8475 8.7970 1.3373 0.5667 0.1731 4.3668 3.1493 8.7352 2.7966 17.1917 0.1702 6.3531 4.9601 41.8646 2.0578 8.7449 6.1963 2.0849 4.6567 27.7947 34.0907 5.4295 7.8489 22.7013 1.5380 1.3269 20.3927 1.5776 4.4496 10.2607 8.5230 2.7122 12.5579 4.2278 10.1139 7.6762 6.8514 20.7261 17.1877 6.8205 20.2579 0.6882 2.0141 5.0779 4.6179 0.7127 0.5757 47.5176 116.4762 29.3340 5.4573 15.8385 28.5108 17.1286 29.3847 40.0959 27.8995 39.0861 19.3069 14.9431 2.1088 10.7516 2.9308 1.9318 0.3047 28.2109 34.8434 19.7425 31.2749 22.4246 39.4290 20.5721 16.9901 99.7268
temp: 298.150 k
press: 1.00000 atm
elementType: 8 7 6 6 6 6 6 6 6 6 6 6 6 6 6 6 6 6 6 6 6 6 6 6 6 6 6 1 1 1 1 1 1 1 1 1 1 1 1 1 1 1 1 1 1 1 1 1 1 1 1 1 1 1
symmnumber: 1
zpe: 1186687.9 jmol-1
zpe.correction: 0.451986 hartree
zpe.thermalcorrener: 0.475884 hartree
zpe.thermalcorrenthalpy: 0.476828 hartree
zpe.thermalcorrgfe: 0.396948 hartree
zpe.sumelectzpe: -1096.881098 hartree
zpe.sumelectthermal: -1096.857199 hartree
zpe.sumelectthermalent: -1096.856255 hartree
zpe.sumelectthermalfe: -1096.936135 hartree
dipole: 0.8239 -0.7186 -0.7207
dipole: 1.3094
quadrupole: -167.7243 -146.6586 -155.7405
quadrupole: 2.0211 9.2402 2.4989
quadrupole: -11.0165 10.0492 0.9673 2.0211 9.2402 2.4989
hfenergy: -1097.3330836 hartree
pointgroup: C01 [X(C25H27N1O1)]
dipole: 0.3104239 0.2432423 0.3314619 debye
polarizability: 291.5883164|6.7143088|280.6868138|-18.7045033|30.5528994|231.2918561 unknown
InChI: InChI=1S/C25H27NO/c1-25(27,23-14-6-3-7-15-23)18-24(21-11-4-2-5-12-21)26-17-16-20-10-8-9-13-22(20)19-26/h2-15,24,27H,16-19H2,1H3
charge 0 multiplicity 1
54 atoms
O  -2.910494 -1.054276 -1.814272
N  1.028331 0.271479 0.237345
C  -0.346694 -0.19997 -0.11896
C  -0.859518 0.335393 -1.493966
C  1.131238 1.707829 0.573868
C  -2.409158 0.334621 -1.691949
C  2.105543 -0.171502 -0.669912
C  2.398643 1.935886 1.419992
C  3.48227 0.306362 -0.218069
C  -0.412168 -1.725879 0.068647
C  3.628109 1.325487 0.760325
C  -3.142935 1.076585 -0.551041
C  -2.772996 0.977341 -3.048494
C  4.637756 -0.258155 -0.813135
C  4.93052 1.757009 1.119014
C  -0.504041 -2.230556 1.3930
C  -0.322087 -2.656404 -0.999255
C  -2.752456 2.386091 -0.162536
C  -4.251732 0.481797 0.099137
C  5.930073 0.172899 -0.447422
C  6.07785 1.189393 0.526164
C  -0.518701 -3.617735 1.646586
C  -0.330518 -4.050091 -0.74973
C  -0.431452 -4.535804 0.572071
C  -3.444191 3.076304 0.85699
C  -4.944657 1.169837 1.122042
C  -4.543368 2.468465 1.507948
H  -1.001183 0.244809 0.657001
H  -0.422436 -0.223311 -2.342022
H  -0.507499 1.379479 -1.59697
H  0.232575 2.000461 1.147244
H  1.175243 2.359871 -0.33674
H  1.946264 0.19064 -1.720083
H  2.094495 -1.276596 -0.7119
H  2.243591 1.467949 2.41197
H  2.554312 3.019455 1.589142
H  -2.232611 0.467654 -3.865572
H  -2.519566 2.051847 -3.060579
H  -3.856204 0.870937 -3.228093
H  4.521634 -1.046763 -1.567899
H  5.04088 2.548196 1.871708
H  -0.553547 -1.519604 2.226132
H  -0.244815 -2.305744 -2.033767
H  -2.462756 -1.625674 -1.135733
H  -1.906301 2.878608 -0.65807
H  -4.567756 -0.517268 -0.216388
H  6.813013 -0.277922 -0.914091
H  7.076353 1.535287 0.816248
H  -0.596014 -3.984417 2.676296
H  -0.262577 -4.751286 -1.58905
H  -0.442639 -5.614356 0.764905
H  -3.128424 4.086791 1.141279
H  -5.800099 0.692301 1.613795
H  -5.0808 3.002249 2.299851
