program: Gaussian 09
title: 000288665
version: EM64L-G09RevD.01
frameworkgroup: C1[X(C8H6N2O3)]
method: RPBEPBE
basis: SDD
operation: Freq
keyword: #pfreq=noraman
keyword: PBEPBE/SDD
title: #p freq=noraman PBEPBE/SDD
converged: NO NO NO NO
title: Mulliken charges:
elementType: O O O N N C C C C C C C C H H H H H H
charge: -0.247843 -0.194564 -0.163116 0.022402 -0.006879 0.271422 0.377045 -0.485491 0.300165 -0.355556 -0.343125 -0.534195 -0.203998 0.315185 0.260298 0.268435 0.230183 0.230184 0.259449
chargesum: 0.00000
title: Mulliken charges with hydrogens summed into heavy atoms:
elementType: O O O N N C C C C C C C C
charge: -0.247843 -0.194564 -0.163116 0.022402 -0.006879 0.271422 0.377045 -0.170307 0.300165 -0.095258 -0.074690 0.185620 -0.203998
polarizability: 1.77795389e+02 1.59478248e+01 1.25941254e+02 1.06708352e-02 3.69194273e-03 4.73747561e+01
1716.lowfreq: -6.6845 -4.0225 -0.0007 0.0000 0.0008 4.7249 39.2024 75.5502 100.8581
frequency: 39.1077 75.5438 100.8569 154.3613 171.3251 183.7584 208.8195 270.4877 277.4645 337.0349 372.6569 426.6387 429.6350 477.5402 520.2767 576.3617 596.9513 670.0942 689.4336 690.3505 734.4292 750.0723 834.9953 872.7839 925.5014 965.9704 998.3373 1045.0437 1113.2145 1137.9665 1167.8153 1194.7229 1206.2809 1238.2669 1271.7620 1355.1358 1379.2962 1436.7375 1442.3717 1468.2285 1469.3331 1493.1421 1557.3458 1626.9236 2172.4496 2972.5816 3066.9149 3142.4400 3161.1679 3182.7014 3191.6346
redmass: 15.0366 4.1184 4.4659 7.7616 7.6532 5.8559 1.1904 4.2858 4.1840 9.2528 8.7263 3.4423 12.5497 10.7176 6.0053 3.6391 5.8288 7.3870 5.3209 6.7452 5.3547 9.6391 1.4641 7.4375 1.4749 1.3571 4.7599 3.2722 1.2574 1.4658 1.4047 2.4690 5.8939 4.1078 1.7256 4.3751 12.8633 1.1875 4.7063 1.0989 1.0492 2.7328 8.5262 7.1747 12.6247 1.0327 1.1048 1.1002 1.0892 1.0962 1.0924
irintensity: 0.1284 0.0531 5.3624 2.0209 0.0103 6.9838 0.0133 9.1115 0.4588 3.4333 0.1600 0.4605 0.6327 0.0847 4.0451 16.9728 1.8505 8.2080 0.2795 15.0070 2.8789 25.1516 48.6187 14.2334 24.4261 3.4629 60.5433 1.8436 0.0882 5.3417 3.8378 39.3368 138.5901 210.2370 98.1966 0.4598 107.8658 20.8784 8.8800 58.0509 16.9123 137.6047 1.4086 116.5113 15.8759 51.0208 37.1189 14.7732 2.1272 4.0599 12.5731
temp: 298.150 k
press: 1.00000 atm
elementType: 8 8 8 7 7 6 6 6 6 6 6 6 6 1 1 1 1 1 1
symmnumber: 1
zpe: 340004.2 jmol-1
zpe.correction: 0.129501 hartree
zpe.thermalcorrener: 0.141073 hartree
zpe.thermalcorrenthalpy: 0.142017 hartree
zpe.thermalcorrgfe: 0.091143 hartree
zpe.sumelectzpe: -642.580578 hartree
zpe.sumelectthermal: -642.569006 hartree
zpe.sumelectthermalent: -642.568062 hartree
zpe.sumelectthermalfe: -642.618935 hartree
dipole: 9.1491 -2.2762 0.0002
dipole: 9.4280
quadrupole: -77.4272 -80.7561 -74.0288
quadrupole: -8.8419 0.0013 0.0004
quadrupole: -0.0232 -3.3520 3.3752 -8.8419 0.0013 0.0004
hfenergy: -642.7100789 hartree
pointgroup: C01 [X(C8H6N2O3)]
dipole: 3.571471 1.001647 -0.000079 debye
dipolederiv: -1.8946332 0.1523366 0.0001877 0.356111 -0.3275038 -0.000039 0.0002228 -0.0000164 -0.2924679 -0.4759653 -0.029596 0.000062 0.0107504 -0.8655167 -0.000102 0.0000631 -0.0000981 -0.2223969 -0.6841949 0.0117898 0.0001498 -0.0462799 -0.5324778 -0.0000203 0.0001347 -0.000082 -0.1887185 1.2321401 0.2621446 -0.0002509 0.2069436 1.3985803 0.00014 -0.0002256 0.000157 0.1963556 -0.3005799 0.0104183 0.0002211 0.1062227 -0.3007115 -0.0001153 0.0000901 -0.0000362 -0.2392822 -0.013939 -0.4737599 0.0000152 -0.3831276 -0.0725791 0.0000242 0.000064 0.0000178 0.0553057 1.6439479 -0.3974433 -0.0001981 -0.6498651 0.0317761 0.0000749 -0.0002357 0.0000392 0.1172783 -0.515634 0.3630598 0.000058 -0.2260948 -0.0282318 0.0000408 0.0000317 -0.0000401 -0.1110555 -0.2106797 -0.1015455 0.0000156 0.1812052 0.0638314 -0.000029 0.0000734 0.0000434 0.1033601 -0.1967292 0.0393311 -0.0000019 0.4133162 -0.0870745 -0.0000406 0.0000297 0.0000004 -0.1732346 0.0957221 0.0291852 -0.0000233 -0.0220704 0.1386963 0.0000374 0.0000058 -0.000029 -0.1069333 0.8685709 0.0487835 -0.0000571 0.3951171 0.2387648 -0.0000501 -0.000037 -0.0000144 0.3158358 0.2907576 0.016589 -0.0002141 -0.1227449 0.1511264 0.0000731 -0.0002262 0.0000753 0.0492574 0.1458857 0.0012026 -0.0000019 0.0321267 0.1082416 -0.0000093 0.0000013 -0.0000041 0.1825344 -0.0115818 -0.0722393 0.0000126 -0.0828129 0.0592376 0.0000033 0.0000088 0.0000116 0.1685987 0.0796786 0.0338277 0.0000163 0.0179497 -0.0221999 -0.0000119 0.00001 -0.0000125 0.1580438 0.0091554 0.0202936 0.0415251 -0.151013 0.0052565 -0.1092052 -0.0226982 -0.0968664 -0.0716184 0.0091474 0.0203284 -0.0415472 -0.1509843 0.0052273 0.1092517 0.0226513 0.096871 -0.0715805 -0.0710686 0.0652938 0.0000311 0.1152504 0.0355568 -0.0000228 0.0000359 -0.0000166 0.1307179 unknown
polarizability: 178.693266|-14.3863932|125.0433768|-0.0107754|0.0033746|47.3747561 unknown
InChI: InChI=1S/C8H6N2O3/c1-13-7-3-2-6(5-9)8(4-7)10(11)12/h2-4H,1H3
charge 0 multiplicity 1
19 atoms
O  3.146845 -0.683213 -0.000461
O  -1.280859 -2.761681 -0.000168
O  -2.821083 -1.081219 0.0005
N  -1.607514 -1.513006 0.000126
N  -3.131315 2.097129 -0.000182
C  -0.50667 -0.506233 0.000029
C  1.88883 -0.094279 -0.000258
C  0.8026 -1.001693 -0.000193
C  -0.797447 0.890412 0.000171
C  1.640933 1.30452 -0.000117
C  0.315946 1.77522 0.000085
C  4.324582 0.197265 -0.000563
C  -2.11144 1.470509 0.000385
H  0.97953 -2.079773 -0.000305
H  2.462099 2.025669 -0.000164
H  0.123291 2.852216 0.000184
H  4.346839 0.830402 0.906463
H  4.346585 0.830536 -0.907501
H  5.184249 -0.48668 -0.000734
