program: Gaussian 09
title: 000288672
version: EM64L-G09RevD.01
frameworkgroup: C1[X(C12H14O3)]
method: RPBEPBE
basis: SDD
operation: Freq
keyword: #pfreq=noraman
keyword: PBEPBE/SDD
title: #p freq=noraman PBEPBE/SDD
converged: YES YES NO NO
title: Mulliken charges:
elementType: O O O C C C C C C C C C C C C H H H H H H H H H H H H H H
charge: -0.302452 -0.267119 -0.209932 0.429850 -0.638999 0.242529 -0.547173 0.340121 -0.352047 -0.356504 -0.021389 0.234017 -0.590234 -0.537344 -0.747749 0.216758 0.249098 0.259161 0.242804 0.245007 0.241623 0.215471 0.214548 0.220504 0.245859 0.222089 0.248754 0.251743 0.251007
chargesum: 0.00000
title: Mulliken charges with hydrogens summed into heavy atoms:
elementType: O O O C C C C C C C C C C C C
charge: -0.302452 -0.267119 -0.209932 0.429850 -0.173142 0.242529 -0.288012 0.340121 -0.109243 -0.111498 0.220234 0.234017 -0.160215 0.151109 0.003755
polarizability: 1.82801837e+02 5.57001999e+00 1.43408535e+02 -4.11733292e+00 9.67902648e+00 9.68525845e+01
1716.lowfreq: -9.3125 -2.0289 -0.0007 -0.0007 -0.0004 7.7539 34.5411 45.8779 56.7862
frequency: 34.5292 45.8544 56.7596 71.4769 76.1875 89.0867 97.0783 133.1949 175.8679 210.4190 242.0964 256.2498 286.2227 300.1001 351.1657 374.7611 410.4053 450.1579 465.8700 534.5289 539.1650 565.3308 582.7525 615.3864 658.7613 701.6147 723.5242 761.9476 807.0689 843.6032 877.0300 894.1574 925.2255 929.9964 934.1700 945.5656 989.4965 1003.1286 1011.5146 1040.0583 1079.7629 1107.9588 1112.4163 1142.7672 1158.7241 1174.5830 1184.8858 1197.0299 1248.0597 1267.2564 1284.0225 1296.8245 1383.3073 1383.9884 1421.3217 1429.0292 1439.0351 1452.6057 1454.0583 1467.1787 1467.9622 1474.6422 1483.0925 1586.5505 1625.6655 1657.1115 1673.0797 2959.0253 2981.1546 3007.9208 3046.6783 3053.2686 3084.9176 3096.3111 3106.9600 3125.6697 3144.4919 3151.9749 3155.7587 3174.1170 3194.2587
redmass: 5.3800 4.0149 2.2642 2.7808 2.2961 1.8886 3.1033 2.8349 3.8558 3.0261 1.3044 3.2759 3.5957 3.6909 3.1624 4.6054 3.0074 3.7465 3.3991 2.6402 3.5668 3.5569 2.3192 4.2334 3.0724 4.6234 4.4548 3.1632 1.6524 4.4386 1.6583 2.4224 1.9352 1.6426 1.7216 1.5203 1.9950 2.5494 1.3148 1.6498 2.3507 1.9323 1.2596 1.4926 2.2389 1.4927 2.1855 1.6451 2.7938 1.5152 1.2932 1.3955 2.6638 1.8256 1.6244 1.5123 1.5004 1.0565 1.0500 1.0514 1.2025 1.1020 2.1093 6.9715 7.4779 4.7043 9.9992 1.0330 1.0632 1.0371 1.1039 1.0966 1.0600 1.0969 1.0946 1.0993 1.1013 1.0881 1.0918 1.0963 1.1143
irintensity: 0.3528 2.2319 4.8617 0.3185 1.2648 1.0214 2.2358 0.4370 6.4000 2.8796 0.8772 2.0701 1.6109 1.3897 0.8428 2.9152 3.0779 8.3709 8.7448 10.0127 6.5984 2.9178 11.1008 5.8839 1.9272 3.5317 10.1523 0.7888 37.4977 59.3311 32.3157 10.2913 28.5337 2.3222 7.9914 54.4354 73.4500 82.7454 1.7591 10.0958 35.6675 45.9929 0.1568 3.2076 500.9662 25.2776 74.3164 0.7221 31.0653 28.6300 2.4850 6.0859 13.9549 52.0276 31.0728 14.2635 1.7709 25.1113 18.3033 12.9968 42.8752 52.8010 81.1546 38.4969 48.4490 15.3145 160.5248 69.2996 14.8838 1.8511 48.7233 11.1216 13.0816 7.0042 8.8130 24.5207 10.1311 8.0805 2.3096 8.9141 26.6008
temp: 298.150 k
press: 1.00000 atm
elementType: 8 8 8 6 6 6 6 6 6 6 6 6 6 6 6 1 1 1 1 1 1 1 1 1 1 1 1 1 1
symmnumber: 1
zpe: 603796.8 jmol-1
zpe.correction: 0.229974 hartree
zpe.thermalcorrener: 0.245788 hartree
zpe.thermalcorrenthalpy: 0.246732 hartree
zpe.thermalcorrgfe: 0.185337 hartree
zpe.sumelectzpe: -690.198658 hartree
zpe.sumelectthermal: -690.182844 hartree
zpe.sumelectthermalent: -690.181900 hartree
zpe.sumelectthermalfe: -690.243295 hartree
dipole: -0.8060 -1.0109 -2.0638
dipole: 2.4353
quadrupole: -68.1645 -84.4763 -94.1325
quadrupole: 4.5268 -2.0419 7.3080
quadrupole: 14.0933 -2.2185 -11.8748 4.5268 -2.0419 7.3080
hfenergy: -690.4286317 hartree
pointgroup: C01 [X(C12H14O3)]
dipole: 0.3346091 0.2787628 -0.8534229 debye
polarizability: 183.4677666|2.8193696|139.9653122|2.022534|-14.9225225|99.6298778 unknown
InChI: InChI=1S/C12H14O3/c1-4-5-10-8-11(14-3)6-7-12(10)15-9(2)13/h4,6-8H,1,5H2,2-3H3
charge 0 multiplicity 1
29 atoms
O  -1.628594 1.006799 -0.79455
O  3.645774 -0.595648 0.402427
O  -2.051855 1.947906 1.314889
C  -0.049749 -0.519191 0.367559
C  -1.196396 -1.358065 0.921957
C  -0.283629 0.628174 -0.435761
C  1.291498 -0.87758 0.610404
C  2.365363 -0.122887 0.075497
C  0.767473 1.383306 -0.976826
C  2.108447 1.015398 -0.727048
C  -1.913448 -2.150317 -0.163138
C  -2.435733 1.676214 0.162206
C  -2.128041 -3.488166 -0.124178
C  4.793621 0.151464 -0.11616
C  -3.788045 1.973084 -0.445492
H  -0.811633 -2.051433 1.690738
H  -1.920205 -0.690383 1.430653
H  1.527906 -1.755435 1.220135
H  0.535143 2.256948 -1.593809
H  2.919512 1.61191 -1.153375
H  -2.266448 -1.566042 -1.025179
H  -2.656138 -4.007547 -0.931918
H  -1.780723 -4.104596 0.71473
H  4.803747 0.1582 -1.223732
H  5.677938 -0.384338 0.258587
H  4.800431 1.192584 0.261564
H  -4.390497 2.564102 0.258849
H  -4.310725 1.027649 -0.675675
H  -3.668891 2.520687 -1.395552
