program: Gaussian 09
title: 000288656
version: EM64L-G09RevD.01
frameworkgroup: C1[X(C10H11NO3)]
method: RPBEPBE
basis: SDD
operation: Freq
keyword: #p
keyword: freq=noraman
keyword: PBEPBE/SDD
title: #p freq=noraman PBEPBE/SDD
converged: NO YES NO NO
title: Mulliken charges:
elementType: O O O N C C C C C C C C C C H H H H H H H H H H H
charge: -0.217036 -0.216984 -0.403438 -0.175369 0.166655 0.166549 0.225446 0.225424 -0.346423 -0.346401 -0.795682 -0.795582 -0.148913 -0.148907 0.260371 0.260372 0.246936 0.234933 0.230126 0.235075 0.246913 0.229997 0.257772 0.257779 0.350388
chargesum: 0.00000
title: Mulliken charges with hydrogens summed into heavy atoms:
elementType: O O O N C C C C C C C C C C
charge: -0.217036 -0.216984 -0.053050 -0.175369 0.166655 0.166549 0.225446 0.225424 -0.086053 -0.086029 -0.083687 -0.083597 0.108859 0.108872
polarizability: 1.67105974e+02 -2.80341053e-02 1.29784260e+02 2.34770649e-03 -1.18327235e-01 8.69097542e+01
1716.lowfreq: -15.9990 -10.8499 -5.3970 -0.0003 0.0003 0.0006 11.2169 39.0240 65.6968
frequency: 6.4846 38.7270 65.6852 102.3623 103.4205 121.2579 163.6812 190.2778 220.5900 230.3809 251.4593 326.0276 379.2737 398.2336 417.7171 484.8784 519.7990 599.7609 608.6111 629.6796 640.8524 652.9442 673.2083 741.9442 744.8142 780.1976 821.2936 859.3706 860.1704 861.0216 865.8744 942.3201 946.6465 991.0100 993.3053 1045.2687 1046.5866 1048.4633 1049.2845 1122.2810 1122.9001 1188.9138 1248.5500 1249.9020 1268.4485 1317.8806 1392.0305 1392.3033 1413.7993 1419.7293 1465.9958 1467.7742 1468.7759 1475.4233 1476.8005 1479.8455 1626.7091 1641.0444 2981.8770 2982.5586 3058.8602 3059.3499 3097.1195 3098.0465 3213.6974 3213.7668 3254.3503 3254.4142 3415.7471
redmass: 3.7765 3.7261 4.9839 1.0428 2.3467 1.4717 5.6898 3.4563 3.6616 3.5124 3.3291 2.7707 1.3935 4.3827 3.4554 6.2409 5.6323 3.9847 3.4422 5.0383 5.6654 4.4587 6.0640 1.4082 1.3192 7.3779 9.4179 2.5197 1.3293 1.8991 5.2857 3.5142 3.4007 1.7872 1.7182 1.5961 1.5738 2.3422 2.2713 1.5661 1.8569 3.1880 1.6697 1.6985 1.2058 6.4720 1.2678 1.4677 2.7468 4.1533 1.0832 1.0532 1.0883 5.0627 1.0603 4.8199 7.8667 8.5301 1.0374 1.0374 1.0979 1.0978 1.0983 1.0979 1.0924 1.0925 1.1066 1.1066 1.0680
irintensity: 0.1855 1.7448 3.5661 0.1419 2.4729 0.9333 0.2754 8.4302 1.3536 0.4999 3.8814 0.8090 145.6966 19.7274 0.5926 4.2760 11.7028 0.3571 1.9797 0.3918 16.3711 0.1966 34.9666 53.8313 19.5700 93.6784 93.5485 15.4930 1.1401 11.4038 8.5240 6.6043 21.8366 11.6816 0.6237 0.3073 13.9516 16.7233 59.6667 33.3146 4.6043 8.0201 0.5499 0.7279 28.4520 10.3284 0.0867 5.6820 30.2179 0.0840 15.7163 0.2342 4.5990 5.8028 19.8922 26.9816 5.2505 0.5884 6.9238 53.7145 6.4004 29.3372 21.5374 4.2990 4.8088 0.8656 1.6325 1.2943 7.1106
temp: 298.150 k
press: 1.00000 atm
elementType: 8 8 8 7 6 6 6 6 6 6 6 6 6 6 1 1 1 1 1 1 1 1 1 1 1
symmnumber: 1
zpe: 498195.5 jmol-1
zpe.correction: 0.189753 hartree
zpe.thermalcorrener: 0.203747 hartree
zpe.thermalcorrenthalpy: 0.204691 hartree
zpe.thermalcorrgfe: 0.146455 hartree
zpe.sumelectzpe: -666.947616 hartree
zpe.sumelectthermal: -666.933622 hartree
zpe.sumelectthermalent: -666.932677 hartree
zpe.sumelectthermalfe: -666.990913 hartree
dipole: -0.0020 0.3927 -1.9870
dipole: 2.0255
quadrupole: -65.6373 -74.2012 -85.4271
quadrupole: -0.0035 -0.0019 -3.0850
quadrupole: 9.4512 0.8874 -10.3386 -0.0035 -0.0019 -3.0850
hfenergy: -667.1373684 hartree
pointgroup: C01 [X(C10H11N1O3)]
dipole: -0.0029237 -0.0821081 -0.7926323 debye
dipolederiv: -0.5518848 -0.1134832 0.1852822 0.1098491 -0.5729047 0.132785 0.1534026 0.210439 -0.2319406 -0.5533925 0.1152478 -0.1831036 -0.1085911 -0.5736688 0.1323367 -0.1522658 0.2088818 -0.2293481 -0.829155 -0.0004659 0.0001735 0.0008975 0.0345293 0.0019022 -0.0004114 -0.229131 -0.803559 0.3246817 0.0005878 0.0012345 -0.0000593 -0.4129898 0.1217586 0.0017682 0.2443683 0.7612515 0.3193093 -0.0604637 -0.0289922 -0.3484806 0.4783527 -0.0820242 -0.4045703 -0.1271163 -0.0919189 0.320829 0.0595185 0.0265035 0.3473694 0.4786283 -0.0827975 0.4036713 -0.1268333 -0.0947249 0.1541767 -0.101978 -0.0561019 0.1058633 0.2416342 -0.0999908 -0.0605888 -0.0495596 -0.0044859 0.1551257 0.1011161 0.0557172 -0.1068075 0.242528 -0.0985559 0.0593994 -0.0487245 -0.0057228 -0.062238 0.0255198 -0.1002412 0.0331516 -0.2683151 -0.0035482 -0.0881115 -0.0033148 -0.1714822 -0.061201 -0.0257365 0.0994801 -0.0334914 -0.2684878 -0.0036598 0.0875362 -0.0034469 -0.1725726 0.024584 -0.0122066 0.035331 -0.0016886 -0.0608634 0.0357324 0.0153679 0.0464983 0.0743985 0.0237816 0.0131542 -0.0350648 0.0023432 -0.0614422 0.0354549 -0.0142463 0.0452091 0.0757562 0.0774187 0.114201 -0.146544 0.1626744 0.1577131 -0.1335683 -0.1406828 -0.1332433 -0.0101712 0.0788955 -0.1154639 0.1457313 -0.1637565 0.1584731 -0.1321164 0.1397489 -0.1319125 -0.0125508 -0.0146985 0.0039871 0.0916237 -0.0155397 0.1243207 0.0303367 0.0999682 0.0226281 0.1452713 -0.0157798 -0.0036538 -0.0906895 0.015875 0.1242051 0.030189 -0.0990636 0.022554 0.1464724 -0.0225195 0.1272521 0.0343255 0.0678778 0.0501375 -0.0006362 0.0524235 -0.0361876 0.0790101 -0.0452084 -0.1130808 -0.0702468 -0.0900653 -0.0076106 -0.0027619 -0.0804784 -0.0489554 0.0759016 0.1193779 0.008226 0.0119294 -0.0210197 0.0401757 0.0172085 0.0386667 0.0742564 -0.1317205 -0.0428067 0.1121706 0.0717672 0.0900253 -0.007897 -0.0039005 0.0819589 -0.0504665 0.0738228 -0.0238144 -0.1274442 -0.0330833 -0.0677144 0.0504927 -0.0000676 -0.0514207 -0.0348199 0.0799041 0.1186188 -0.0073867 -0.0150407 0.0209806 0.0401928 0.017394 -0.04161 0.0748795 -0.1310526 0.0773449 0.0437747 0.0411458 0.0642822 0.010417 0.0318506 0.0473928 0.0366962 0.1772486 0.076949 -0.0433723 -0.0407033 -0.0639952 0.0101707 0.0317607 -0.0471807 0.0363938 0.1779502 0.3516056 -0.00002 -0.0004337 0.0000197 -0.0077918 0.0249182 -0.0006743 0.000907 0.2242626 unknown
polarizability: 167.1054148|-0.0839303|126.0136487|-0.1974435|-12.1431913|90.6809246 unknown
InChI: InChI=1S/C10H11NO3/c1-7-3-5-13-9(7)11(12)10-8(2)4-6-14-10/h3-6,12H,1-2H3
charge 0 multiplicity 1
25 atoms
O  1.63192 -1.395851 0.702391
O  -1.624177 -1.395848 0.707553
O  0.008214 0.649941 2.457586
N  0.004312 0.398537 0.952715
C  1.231609 -0.026799 0.471265
C  -1.225599 -0.026111 0.477386
C  2.248862 0.643381 -0.200627
C  -2.246935 0.645348 -0.187019
C  3.31027 -0.319136 -0.417287
C  -3.309297 -0.316968 -0.399819
C  2.231799 2.091006 -0.605226
C  -2.232891 2.094072 -0.587764
C  2.903944 -1.519289 0.142643
C  -2.899353 -1.518348 0.154831
H  4.256457 -0.132601 -0.92264
H  -4.258443 -0.129548 -0.899266
H  1.299815 2.573385 -0.267301
H  3.08235 2.638989 -0.159508
H  2.306019 2.20523 -1.702792
H  -3.077218 2.641838 -0.130037
H  -1.296344 2.574386 -0.259665
H  -2.320428 2.211535 -1.683978
H  3.364913 -2.500474 0.223968
H  -3.359424 -2.499952 0.236197
H  0.009228 -0.269622 2.857995
