program: Gaussian 09
title: 000288641
version: EM64L-G09RevD.01
frameworkgroup: C1[X(C10H14O2)]
method: RPBEPBE
basis: SDD
operation: Freq
keyword: #pfreq=noraman
keyword: PBEPBE/SDD
title: #p freq=noraman PBEPBE/SDD
converged: YES YES NO NO
title: Mulliken charges:
elementType: O O C C C C C C C C C C H H H H H H H H H H H H H H
charge: -0.290073 -0.284861 0.151868 -0.544268 -0.023880 0.167400 -0.602597 -0.494254 0.318228 -0.704119 -0.342030 -0.527244 0.225301 0.221053 0.228214 0.234099 0.224780 0.228465 0.227943 0.230938 0.237485 0.208742 0.234721 0.238094 0.215355 0.220640
chargesum: 0.00000
title: Mulliken charges with hydrogens summed into heavy atoms:
elementType: O O C C C C C C C C C C
charge: -0.290073 -0.284861 0.151868 -0.097914 0.204335 0.167400 -0.143718 -0.037847 0.318228 -0.026954 -0.107309 0.146845
polarizability: 1.33462734e+02 -9.00941294e+00 1.19802823e+02 3.80713273e-01 3.87093391e-01 7.39872454e+01
1716.lowfreq: -18.8239 -4.8735 -0.0004 -0.0002 0.0005 11.5836 33.9560 67.3831 80.8665
frequency: 33.9152 67.3783 80.8570 155.2205 179.1023 198.8790 242.7113 251.4409 274.6219 296.1901 358.7595 384.2423 431.0182 436.3960 501.0840 519.9865 544.3042 654.3195 693.2055 752.8644 796.7447 817.3198 838.9054 878.2775 905.0470 942.2837 956.0057 974.8554 1015.2076 1028.3718 1065.5235 1075.2576 1107.4516 1109.3527 1124.1774 1158.5373 1162.8326 1175.6806 1189.3268 1196.8075 1206.6833 1267.8235 1287.7270 1300.9929 1326.9414 1351.6088 1378.6340 1386.1459 1440.0266 1455.5728 1460.5824 1463.4450 1468.1779 1471.1973 1475.1477 1478.0258 1688.8638 1733.7947 2914.5964 2940.7499 2950.8429 2953.7816 2956.5174 2980.0913 2982.7686 2998.9141 3039.1898 3042.3124 3080.7531 3096.1536 3111.9961 3146.1321
redmass: 2.9606 2.8777 3.2109 2.8001 2.5013 1.3461 1.4663 1.4855 2.7350 2.9783 3.6104 3.1057 3.1085 3.1520 2.9975 3.7429 4.9013 4.4323 4.5852 6.7146 3.2404 1.3010 3.8793 2.9257 1.4274 5.8508 1.6057 1.9015 2.0630 1.8524 1.7316 2.6750 1.3157 1.6929 2.2707 1.5722 1.1495 1.2502 2.9991 1.4143 1.6181 1.4194 1.3889 2.3838 1.4382 2.1541 3.3875 1.2437 1.1509 1.0929 1.0482 1.0968 1.0538 1.0680 1.0581 1.0723 7.3088 8.0412 1.0576 1.0952 1.0589 1.0373 1.0584 1.0982 1.0361 1.1015 1.1034 1.0894 1.0986 1.1004 1.0989 1.0908
irintensity: 0.2847 6.9410 1.1392 3.0147 2.8904 0.1434 6.7395 6.5392 1.2435 3.9784 0.3119 5.5863 1.1814 3.0167 5.5146 1.1370 1.2499 2.4332 18.1325 6.6420 23.9241 37.5596 2.3032 8.4933 2.6736 18.0948 1.4039 1.0266 7.5278 51.4926 3.2250 3.1525 1.4308 4.1993 178.1175 62.7540 2.9510 9.0450 7.8050 24.8893 76.9882 7.6128 1.9117 0.3576 22.0846 39.0718 1.0804 24.3586 1.5117 3.1506 11.1637 6.3507 13.7197 11.7475 16.7100 1.3251 63.2047 10.4146 59.3865 17.5144 72.7119 53.9099 76.7493 18.1733 19.9307 24.8326 55.6566 32.2584 37.0610 34.7038 30.0355 17.0969
temp: 298.150 k
press: 1.00000 atm
elementType: 8 8 6 6 6 6 6 6 6 6 6 6 1 1 1 1 1 1 1 1 1 1 1 1 1 1
symmnumber: 1
zpe: 570682.4 jmol-1
zpe.correction: 0.217361 hartree
zpe.thermalcorrener: 0.229370 hartree
zpe.thermalcorrenthalpy: 0.230315 hartree
zpe.thermalcorrgfe: 0.178892 hartree
zpe.sumelectzpe: -538.936019 hartree
zpe.sumelectthermal: -538.924010 hartree
zpe.sumelectthermalent: -538.923066 hartree
zpe.sumelectthermalfe: -538.974488 hartree
dipole: -0.1476 -2.9304 -0.7071
dipole: 3.0181
quadrupole: -68.4970 -67.2698 -73.3682
quadrupole: -1.0006 -3.6905 0.8942
quadrupole: 1.2147 2.4418 -3.6565 -1.0006 -3.6905 0.8942
hfenergy: -539.1533802 hartree
pointgroup: C01 [X(C10H14O2)]
dipole: 0.0832078 1.1572677 -0.2525727 debye
dipolederiv: -1.3138592 0.1237762 -0.0032078 -0.2288087 -0.4751462 -0.0528044 0.0769339 -0.0684946 -0.3035279 -1.2703469 0.5797644 -0.0120243 0.3119799 -0.64343 -0.0087434 0.1544963 -0.1656095 -0.3355508 -0.0172981 0.0152222 -0.0377972 0.229483 -0.1851365 -0.0027925 -0.0382346 -0.0274634 -0.2239948 -0.245467 0.0932636 0.0210684 0.0440681 0.0736626 -0.0122896 0.0263615 0.0064827 0.2181788 0.5938669 0.1012209 0.0514869 0.3624507 0.2677441 0.0216495 0.0770048 0.0243297 0.3883293 1.0112057 -0.1764958 -0.0611912 -0.1852264 0.3841455 0.0057775 -0.1567629 0.0343012 -0.0254632 -0.08277 -0.0853281 0.04242 -0.2256867 0.0282156 0.0076417 0.089758 -0.0480829 0.2713701 -0.0339054 -0.0435373 0.0273723 -0.0417021 0.0290056 0.0069511 0.0190467 0.0115735 0.2588237 1.0897018 -0.4542254 -0.0916533 -0.0814639 0.4886166 0.1085785 -0.2558296 0.2308242 -0.0100857 -0.0711842 -0.0077204 -0.1014685 -0.0416675 0.0716298 0.0046526 -0.1179512 -0.0232092 -0.0966847 -0.0376034 0.0576214 -0.0577939 0.1470653 -0.2365425 -0.0290702 -0.0292235 -0.0055894 -0.2750797 0.4300082 -0.1623806 0.0827539 -0.3511778 0.5807273 -0.0478699 0.1553676 -0.0426142 0.3562903 0.0457561 -0.0141488 -0.0306558 -0.0049135 -0.0562748 0.1055631 0.004842 0.1655602 -0.091275 0.0658589 -0.0513472 -0.007749 -0.0542724 -0.0673837 -0.0884157 -0.041424 -0.1523937 -0.046111 -0.0659551 -0.0136429 0.0712001 -0.0525471 0.0489061 0.0076683 0.1069715 0.0206745 -0.1163636 0.0165986 0.0108313 0.0304619 0.0541429 -0.0627004 -0.0976336 0.0764234 -0.1495642 -0.0598589 -0.0079214 0.0601944 -0.0441047 0.0766898 -0.0680724 0.0818082 -0.0961588 0.1418475 -0.0370699 -0.0219318 0.075406 -0.0485018 0.0324097 -0.0382141 0.0838626 -0.0559758 0.1551791 -0.0188809 0.0151931 0.0306823 0.0354435 0.007336 -0.02669 -0.0888517 0.0470216 -0.1645609 -0.0466555 0.0192057 -0.0099378 0.1280543 0.0054813 0.0838203 0.0156123 0.074015 0.009247 -0.0644494 -0.0220719 0.0971889 -0.0205379 0.1586277 -0.017499 0.0101319 -0.0098072 -0.0221098 0.0825628 0.008892 -0.0826367 -0.0178256 -0.1482661 -0.0928605 -0.0111234 -0.0347968 0.0170726 0.0814707 -0.0627347 -0.0955724 0.023465 -0.1023058 0.0068783 0.0066665 0.0365899 0.0100403 0.1774354 -0.1605193 0.0492494 0.0525203 0.0021395 0.0852724 0.0188036 0.0754982 0.0036018 0.0849549 0.071614 0.0249407 0.0282896 0.0919641 -0.0104543 -0.0035261 -0.0976674 0.0802425 -0.1976848 0.0456674 -0.1223882 -0.0600251 -0.0058001 -0.1682196 -0.042247 -0.0864985 -0.0412851 0.0293199 unknown
polarizability: 133.0813681|-9.2800595|120.1820734|-0.3814593|0.6008223|73.9893607 unknown
InChI: InChI=1S/C10H14O2/c1-7-5-8-6-9(11-2)3-4-10(8)12-7/h3,7H,4-6H2,1-2H3
charge 0 multiplicity 1
26 atoms
O  2.238485 -0.968938 -0.505828
O  -3.245909 0.022026 0.347193
C  0.480076 0.538639 -0.230401
C  1.697327 1.434629 -0.413867
C  2.881047 0.408645 -0.447092
C  0.856244 -0.762787 -0.30401
C  -0.945587 0.983252 -0.040211
C  -0.040522 -1.959532 -0.210953
C  -1.878514 -0.219863 0.049585
C  3.783767 0.452034 0.789425
C  -1.484153 -1.519058 -0.038584
C  -3.861498 1.226352 -0.222231
H  1.638204 2.024641 -1.351272
H  1.827523 2.157881 0.416237
H  3.476821 0.487436 -1.372914
H  -1.054072 1.597612 0.882062
H  -1.254368 1.65012 -0.8762
H  0.275599 -2.607983 0.633604
H  0.070344 -2.586986 -1.120545
H  3.180279 0.35423 1.709789
H  4.517445 -0.37213 0.76492
H  4.334404 1.410725 0.830666
H  -2.251121 -2.297241 0.048527
H  -4.906973 1.200423 0.1215
H  -3.835397 1.211481 -1.33018
H  -3.383251 2.154892 0.14588
