program: Gaussian 09
title: 000288640
version: EM64L-G09RevD.01
frameworkgroup: C1[X(C10H18O2)]
method: RPBEPBE
basis: SDD
operation: Freq
keyword: #pfreq=noraman
keyword: PBEPBE/SDD
title: #p freq=noraman PBEPBE/SDD
converged: YES YES NO NO
title: Mulliken charges:
elementType: O O C C C C C C C C C C H H H H H H H H H H H H H H H H H H
charge: -0.429207 -0.434104 -0.114811 -0.108059 -0.102143 -0.060993 -0.479043 -0.478651 -0.475022 -0.481543 -0.426277 -0.435730 0.200221 0.177168 0.196168 0.244135 0.212768 0.214501 0.222075 0.205579 0.219022 0.205802 0.211585 0.219865 0.190428 0.229416 0.183935 0.235204 0.329364 0.328346
chargesum: 0.00000
title: Mulliken charges with hydrogens summed into heavy atoms:
elementType: O O C C C C C C C C C C
charge: -0.099843 -0.105758 0.085410 0.069110 0.094024 0.183142 -0.051773 -0.050997 -0.050197 -0.050093 -0.006434 -0.016591
polarizability: 1.12609677e+02 4.76670171e-01 1.08090872e+02 -1.78577702e+00 8.58763918e-01 9.71824951e+01
1716.lowfreq: -0.0007 -0.0007 -0.0005 11.6221 21.3995 29.4496 47.6280 88.1377 108.1124
frequency: 44.9997 88.0417 108.0568 152.1506 193.6624 214.8616 230.6270 272.9852 297.1587 307.5573 335.3310 356.0596 431.0245 442.4368 472.8318 532.0450 562.2673 636.3416 764.4539 787.1353 807.8525 833.8044 858.6138 872.6442 880.1326 933.5962 938.8453 955.3693 968.7411 982.9591 1005.4620 1040.8732 1059.9498 1063.9475 1079.4640 1086.6698 1096.6551 1112.2377 1141.3598 1151.3924 1157.2918 1194.0778 1199.8270 1228.3367 1233.6066 1258.5803 1269.4107 1285.7184 1299.9127 1310.0158 1315.5358 1321.5727 1326.8129 1331.8644 1335.5168 1341.8228 1358.4910 1366.5849 1371.7935 1376.3013 1464.2319 1465.6138 1470.3049 1473.8972 1486.6697 1499.1952 2909.0065 2932.3297 2944.2301 2962.8335 2973.9449 2979.1095 2985.7678 2989.0900 2994.7016 3007.4124 3022.9780 3026.9804 3048.3115 3055.7983 3069.5916 3075.8258 3554.3362 3563.1634
redmass: 3.5271 3.7379 2.2508 4.3821 2.6784 2.1844 1.9474 2.1820 1.3137 1.8258 1.5785 2.5951 3.2584 2.9482 3.3843 3.4510 3.1589 5.3265 2.6235 1.3171 1.8025 2.1988 2.4615 2.4905 2.4387 1.8928 1.7624 3.5893 3.0726 3.0400 1.9007 2.0750 2.1196 2.0356 1.8666 1.6221 1.7817 2.1403 1.1670 1.1752 1.2175 1.3069 1.4880 1.1593 1.2006 1.4756 1.3569 1.5901 1.3891 1.4287 1.2934 1.6476 1.3304 1.4987 1.3664 1.3583 1.4060 1.3914 1.2656 1.2478 1.0776 1.0863 1.0767 1.0848 1.0838 1.0884 1.0819 1.0699 1.0687 1.0762 1.0667 1.0610 1.0807 1.0747 1.0627 1.0735 1.1026 1.1028 1.1037 1.1030 1.0950 1.0933 1.0661 1.0658
irintensity: 0.1797 0.4806 5.7274 1.1095 2.9948 7.9612 16.2646 16.1047 142.7112 50.6093 105.3865 4.0508 1.5261 16.2119 9.1377 4.5728 4.8281 0.4010 2.1244 0.7564 3.0642 9.2944 0.7779 12.7248 0.8463 49.8944 16.7633 46.0027 24.6571 62.9454 4.2762 12.0375 1.9667 3.2598 1.1286 3.9183 5.0416 7.2762 17.5543 16.9892 19.9483 1.9201 7.6531 0.0892 1.2199 15.2287 3.2662 4.6885 5.3789 2.1855 2.3772 1.7856 0.4646 1.4581 1.7725 3.3502 2.9829 1.9631 22.0698 12.4298 0.8891 1.9444 3.1162 10.2111 18.8641 7.8180 28.5528 58.6954 66.0640 17.8681 13.2212 2.3503 32.7021 187.4859 102.7120 34.8151 1.8104 1.9347 34.9088 109.2396 34.4404 17.8230 6.2095 3.6268
temp: 298.150 k
press: 1.00000 atm
elementType: 8 8 6 6 6 6 6 6 6 6 6 6 1 1 1 1 1 1 1 1 1 1 1 1 1 1 1 1 1 1
symmnumber: 1
zpe: 699450.5 jmol-1
zpe.correction: 0.266407 hartree
zpe.thermalcorrener: 0.278422 hartree
zpe.thermalcorrenthalpy: 0.279366 hartree
zpe.thermalcorrgfe: 0.228710 hartree
zpe.sumelectzpe: -541.309814 hartree
zpe.sumelectthermal: -541.297799 hartree
zpe.sumelectthermalent: -541.296855 hartree
zpe.sumelectthermalfe: -541.347511 hartree
dipole: -3.4048 -0.8743 -1.9717
dipole: 4.0304
quadrupole: -83.9806 -75.4716 -72.5086
quadrupole: -4.5785 -6.9815 2.2699
quadrupole: -6.6603 1.8486 4.8117 -4.5785 -6.9815 2.2699
hfenergy: -541.5762205 hartree
pointgroup: C01[X(C10H18O2)]
dipole: -1.3739132 -0.2755392 -0.7422135 debye
polarizability: 112.5320835|0.3468355|108.0261553|-2.1714288|1.0982108|97.3248053 unknown
InChI: InChI=1S/C10H18O2/c11-5-9-7-1-2-8(4-3-7)10(9)6-12/h7-12H,1-6H2
charge 0 multiplicity 1
30 atoms
O  2.592119 -1.927742 -0.024597
O  2.129026 2.500774 0.257628
C  -1.18592 -1.128908 -0.514678
C  -0.680707 1.20549 0.522653
C  0.354311 -0.881512 -0.500964
C  0.659407 0.447909 0.276025
C  -1.85775 -0.022597 -1.370937
C  -1.765442 -1.063155 0.924716
C  -1.464057 1.385031 -0.805988
C  -1.543327 0.372846 1.509073
C  1.128638 -2.093162 0.054696
C  1.722215 1.286612 -0.467176
H  -1.398435 -2.122682 -0.959164
H  -0.479363 2.196604 0.981019
H  0.666392 -0.753994 -1.564512
H  1.094742 0.193259 1.264006
H  -2.955829 -0.159802 -1.34844
H  -1.543906 -0.122447 -2.427816
H  -1.291936 -1.828288 1.567768
H  -2.843924 -1.30793 0.89095
H  -0.854441 1.945209 -1.540556
H  -2.367411 1.996259 -0.620625
H  -2.511749 0.883788 1.671525
H  -1.038574 0.32295 2.492436
H  0.814371 -3.019856 -0.474602
H  0.93781 -2.226081 1.13278
H  1.369389 1.545093 -1.491002
H  2.65212 0.700574 -0.55284
H  2.852082 -1.871815 -0.979289
H  1.336351 3.08107 0.381112
