program: Gaussian 09
title: 000288617
version: EM64L-G09RevD.01
frameworkgroup: C1[X(C16H22N2O)]
method: RPBEPBE
basis: SDD
operation: Freq
keyword: #p
keyword: freq=noraman
keyword: PBEPBE/SDD
title: #p freq=noraman PBEPBE/SDD
converged: YES YES NO NO
title: Mulliken charges:
elementType: O N N C C C C C C C C C C C C C C C C H H H H H H H H H H H H H H H H H H H H H H
charge: -0.456619 -0.080894 -0.432793 -0.200850 -0.143765 -0.052860 -0.242018 -0.447282 -0.497423 -0.429329 -0.402933 0.283541 0.225583 -0.332482 -0.436897 -0.399969 -0.343672 -0.266802 -0.209608 0.218759 0.251808 0.205282 0.236576 0.209163 0.208503 0.203044 0.226620 0.200275 0.187606 0.189825 0.204575 0.261901 0.202788 0.221535 0.233619 0.225594 0.202714 0.193819 0.219446 0.217527 0.346094
chargesum: 0.00000
title: Mulliken charges with hydrogens summed into heavy atoms:
elementType: O N N C C C C C C C C C C C C C C C C
charge: -0.110525 -0.080894 -0.170893 0.017909 0.108043 0.152422 -0.005442 -0.029617 -0.067759 -0.041447 -0.008532 0.283541 0.225583 0.091841 -0.203279 -0.174375 0.052861 -0.047356 0.007919
polarizability: 2.41141922e+02 8.30351068e+00 1.58071576e+02 8.57530380e+00 -1.68434782e+01 1.47379649e+02
1716.lowfreq: -11.7156 -0.0005 0.0004 0.0007 3.3899 11.8662 39.7960 58.7859 76.5473
frequency: 39.7667 58.7689 76.5292 82.6741 85.7591 136.7149 154.8042 218.2140 247.4540 250.2895 259.9381 280.0367 300.8129 327.2835 353.2764 370.9517 405.5465 413.4024 441.1402 454.0948 469.2775 520.4677 542.2426 557.9064 597.4908 606.7434 635.6517 719.6076 730.7842 747.4641 749.7878 760.1663 778.4649 811.1475 815.1275 827.1987 846.3973 866.0238 879.1273 909.0809 923.5463 940.9291 963.4120 971.3032 977.0066 992.2508 1007.4806 1017.7576 1019.8346 1036.9644 1058.5437 1063.6561 1085.5539 1103.9794 1110.7029 1112.9407 1125.6412 1136.4636 1158.3121 1167.0366 1177.1450 1184.9472 1209.0231 1209.6808 1222.6242 1241.9580 1257.6221 1264.3727 1266.9367 1288.6135 1292.3680 1295.3359 1306.3961 1312.1031 1328.8347 1333.4210 1338.2392 1348.5510 1352.6368 1355.0863 1365.8842 1378.4305 1381.8053 1412.2992 1424.4691 1449.6039 1457.3635 1458.2098 1467.3433 1470.7337 1481.7213 1483.7153 1499.9065 1602.5990 1623.5982 2861.0864 2890.5703 2910.1472 2950.0185 2967.3166 2973.6094 2975.7255 2988.2241 3004.5431 3005.9035 3013.0710 3017.7690 3034.8780 3042.2425 3044.2428 3061.1771 3117.9285 3124.1452 3140.0419 3160.3168 3547.9467 3577.0549
redmass: 4.7952 4.8429 2.4502 3.6608 3.0754 3.3155 3.7623 3.6831 2.8291 3.3629 1.1705 4.0640 3.3515 2.6181 3.0890 1.8470 2.4803 3.1322 3.0880 1.8920 2.2928 4.0138 3.7897 3.7369 5.7171 3.7446 4.5531 3.8311 3.1270 1.6152 2.3182 3.7827 2.5795 1.3065 2.7761 1.8658 1.4137 3.5665 2.4730 2.2994 1.5609 2.4350 1.2990 6.5137 2.5240 2.2169 2.2512 2.2517 2.1316 2.4204 2.1481 1.9815 1.9897 1.8027 1.3961 1.6537 1.8623 2.2269 1.4225 1.0835 1.1704 2.3429 1.2160 1.2528 1.2925 1.3407 1.5143 1.7397 1.6879 1.5401 1.2388 1.5381 1.8215 1.3467 1.4548 1.3771 1.4792 1.3892 1.3540 1.4475 1.4702 1.8700 1.4794 1.4501 2.5099 1.0922 1.0911 2.4945 1.0785 1.0914 1.1257 2.9645 1.0956 6.4654 7.1953 1.0718 1.0822 1.0691 1.0564 1.0692 1.0819 1.0608 1.0719 1.0879 1.0824 1.0840 1.0910 1.1016 1.0975 1.0964 1.1034 1.0853 1.0895 1.0941 1.0998 1.0777 1.0666
irintensity: 0.2198 1.2478 5.0551 0.1569 7.0560 0.9133 0.2436 1.8556 20.6139 7.3770 137.8925 6.5585 2.7392 1.6117 1.1053 0.6991 5.9339 1.1280 19.3127 87.6107 74.2692 2.8294 5.8506 1.1655 7.9144 1.7743 4.0966 5.7154 11.9516 71.9527 17.1319 9.3884 1.9913 1.1484 0.4256 2.6098 1.9037 2.9623 0.3077 6.2295 6.2055 6.4480 0.2696 93.8025 24.0558 4.3006 17.8726 4.7095 21.6202 1.7486 12.6813 30.3434 8.9513 8.4043 9.4807 2.6934 9.8239 36.3862 2.7112 1.3077 5.9323 2.1342 3.6687 35.2864 9.5921 30.6132 4.1154 12.2980 60.5431 7.1982 21.4072 8.3257 2.5473 18.3864 3.4640 2.1537 4.5825 11.1505 5.7672 1.9477 2.5490 15.9900 4.5358 0.3341 1.0715 13.2379 13.4200 24.2268 2.6844 11.6708 22.7172 70.2501 15.9329 1.1085 75.2650 79.6736 56.0866 66.8120 63.1335 6.7905 27.7908 21.1128 92.9099 15.1466 92.0223 68.8347 1.3730 29.2126 48.0716 69.3781 46.4216 5.3242 8.4615 35.0368 34.8626 12.0834 3.2039
temp: 298.150 k
press: 1.00000 atm
elementType: 8 7 7 6 6 6 6 6 6 6 6 6 6 6 6 6 6 6 6 1 1 1 1 1 1 1 1 1 1 1 1 1 1 1 1 1 1 1 1 1 1
symmnumber: 1
zpe: 928616.0 jmol-1
zpe.correction: 0.353691 hartree
zpe.thermalcorrener: 0.370169 hartree
zpe.thermalcorrenthalpy: 0.371113 hartree
zpe.thermalcorrgfe: 0.309870 hartree
zpe.sumelectzpe: -806.171406 hartree
zpe.sumelectthermal: -806.154929 hartree
zpe.sumelectthermalent: -806.153985 hartree
zpe.sumelectthermalfe: -806.215227 hartree
dipole: 2.3050 0.7856 0.6881
dipole: 2.5306
quadrupole: -105.6096 -114.8142 -112.6941
quadrupole: 3.0415 0.9520 -8.8105
quadrupole: 5.4297 -3.7749 -1.6548 3.0415 0.9520 -8.8105
hfenergy: -806.5250973 hartree
pointgroup: C01 [X(C16H22N2O1)]
dipole: -0.9209659 0.2961774 -0.2352521 debye
polarizability: 241.8427424|-5.7212512|155.2521943|6.0081167|17.7574382|149.4982104 unknown
InChI: InChI=1S/C16H22N2O/c19-8-7-18-6-5-11-9-13-12-3-1-2-4-14(12)17-16(13)15(18)10-11/h1-4,11,13,15-17,19H,5-10H2
charge 0 multiplicity 1
41 atoms
O  -5.072898 -2.532775 0.683366
N  -2.512111 0.065718 -0.123768
N  1.035161 -0.972389 -1.187523
C  -1.297672 -0.001481 -0.983259
C  -0.031643 -0.537065 -0.239599
C  -0.726732 2.376453 -0.44029
C  0.724773 0.4863 0.686979
C  -1.028505 1.388197 -1.591241
C  0.620849 1.978058 0.218452
C  -1.949713 2.424761 0.515639
C  -2.414792 1.031646 0.998283
C  2.17029 -0.006182 0.586834
C  2.293024 -0.830196 -0.571036
C  -3.084658 -1.239807 0.273527
C  3.299466 0.301011 1.35859
C  3.544883 -1.350592 -0.965852
C  -4.619456 -1.215298 0.202052
C  4.565743 -0.226207 0.981568
C  4.67741 -1.038557 -0.171313
H  -1.531606 -0.716896 -1.798233
H  -0.342938 -1.403354 0.39138
H  -0.593146 3.394182 -0.85975
H  0.335693 0.404997 1.716999
H  -1.920248 1.708299 -2.161047
H  -0.169398 1.329009 -2.285189
H  0.83809 2.635322 1.08362
H  1.421645 2.162058 -0.524296
H  -2.788328 2.902838 -0.028314
H  -1.727085 3.056204 1.39844
H  -1.734524 0.657999 1.803767
H  -3.414375 1.126445 1.463892
H  0.851081 -1.748628 -1.824943
H  -2.787081 -1.548346 1.302966
H  -2.723195 -2.02652 -0.414406
H  3.210639 0.937164 2.24763
H  3.645838 -1.981958 -1.855983
H  -4.936594 -1.032008 -0.844904
H  -5.021785 -0.40049 0.840679
H  5.453532 -0.005583 1.5838
H  5.656576 -1.440913 -0.457013
H  -6.059505 -2.583416 0.627396
