program: Gaussian 09
title: 000288613
version: EM64L-G09RevD.01
frameworkgroup: C1[X(C15H16N2O)]
method: RPBEPBE
basis: SDD
operation: Freq
keyword: #p
keyword: freq=noraman
keyword: PBEPBE/SDD
title: #p freq=noraman PBEPBE/SDD
converged: YES YES NO NO
title: Mulliken charges:
elementType: O N N C C C C C C C C C C C C C C C H H H H H H H H H H H H H H H H
charge: -0.189069 -0.232434 -0.014436 -0.267341 -0.214325 -0.509887 -0.001875 0.273044 -0.538962 0.110559 0.273854 -0.489152 -0.416187 -0.659609 -0.382623 -0.259427 -0.216239 -0.162036 0.250447 0.266575 0.210192 0.252066 0.276071 0.257436 0.242466 0.249591 0.255182 0.238409 0.226703 0.230345 0.257083 0.234072 0.226822 0.222685
chargesum: 0.00000
title: Mulliken charges with hydrogens summed into heavy atoms:
elementType: O N N C C C C C C C C C C C C C C C
charge: -0.189069 -0.232434 -0.014436 -0.016894 0.052251 -0.047629 0.274196 0.273044 -0.039061 0.110559 0.273854 0.015621 -0.177778 0.054522 -0.148551 -0.032606 0.006446 -0.162036
polarizability: 1.69950975e+02 2.42317106e+01 2.02832819e+02 1.61211588e+01 -7.90591386e+00 1.26451134e+02
1716.lowfreq: -16.4040 -13.0482 -4.0008 -0.0007 -0.0001 0.0004 27.3296 35.8138 47.1762
frequency: 27.1912 35.4268 47.0931 80.2285 102.5226 110.1503 132.0964 148.7776 186.6055 246.2380 263.0241 266.6855 296.9293 313.6086 369.1388 383.0531 409.3191 419.1473 475.4285 487.3122 501.8730 530.6607 554.6288 587.8546 601.1920 606.2842 691.1315 741.3687 744.1745 752.5120 786.4005 806.2962 845.5572 855.0703 863.0113 917.3989 921.4115 929.7748 952.2074 964.7412 969.9434 1020.3782 1027.7258 1049.2884 1072.0681 1079.8820 1110.6779 1115.4170 1125.0519 1148.7632 1168.2577 1178.0911 1184.3133 1194.5185 1212.3251 1241.5087 1254.3760 1260.1828 1262.0459 1280.6866 1285.4692 1302.3976 1304.7462 1323.5966 1341.1846 1345.7319 1362.2870 1407.3507 1421.3329 1440.1412 1444.1376 1453.0910 1466.5156 1474.3951 1485.0019 1495.7719 1600.4245 1613.5566 1618.8103 2198.1796 2929.0564 2959.3608 2966.3457 2977.1213 2980.4446 3008.0486 3022.8592 3032.6313 3039.3883 3040.5660 3048.0400 3092.5921 3123.7974 3131.7492 3151.4107 3166.3875
redmass: 5.0085 5.5341 5.9863 4.0060 3.4519 2.5044 1.4317 2.7212 3.3721 3.3620 4.0579 3.8572 3.6163 4.9580 3.0005 2.6762 4.6408 3.7004 4.0633 4.8319 3.5820 5.1155 4.4638 4.2590 3.3590 4.1599 4.4766 2.6995 2.9535 1.7516 3.3346 3.5754 1.4373 1.9964 2.3142 2.6292 2.5211 1.4485 3.2170 2.8012 1.3190 2.2626 2.4089 3.4687 1.9632 2.9388 1.6514 1.9533 1.6266 1.1979 1.1432 1.1920 1.7665 2.1683 2.3298 1.9781 1.5566 1.3126 1.4232 1.4973 1.4463 1.5477 1.4067 1.2811 1.4758 2.5914 1.4753 4.0773 1.0912 1.4052 1.0886 1.8904 1.0990 1.1418 1.1801 2.2012 7.3260 9.4051 7.4492 12.4434 1.0483 1.0851 1.0649 1.0602 1.0596 1.0854 1.0860 1.0991 1.0854 1.0981 1.0987 1.0997 1.0871 1.0889 1.0933 1.0999
irintensity: 0.2310 11.4971 1.6399 4.3094 0.7401 4.1414 0.5660 1.1213 7.7353 0.7732 2.8986 7.8276 1.9407 1.8750 0.7073 0.3853 0.8639 17.0092 0.4890 2.9507 5.5017 3.3372 4.0295 0.7093 6.7719 10.3405 2.7206 10.4508 10.6134 78.6468 8.0979 5.4654 4.3977 4.8818 6.7608 4.5937 1.7358 2.3681 5.7615 19.3976 0.4644 12.5307 0.4197 0.0824 1.7400 8.7508 3.2276 7.9064 12.5503 1.0103 2.1709 0.6303 24.2692 7.1670 18.8320 26.4617 6.6631 12.0679 59.1805 21.0844 1.4182 4.6023 2.0382 0.8296 4.5048 21.1690 4.6958 11.5693 10.1907 10.2834 21.0833 6.0860 17.4670 28.1333 2.8556 144.9998 4.8454 267.6134 10.6857 9.4744 93.5392 43.4569 26.9837 8.8788 16.4460 2.4243 34.4132 5.6133 23.9714 14.8498 27.8978 8.7717 4.4561 10.8509 24.8966 22.8032
temp: 298.150 k
press: 1.00000 atm
elementType: 8 7 7 6 6 6 6 6 6 6 6 6 6 6 6 6 6 6 1 1 1 1 1 1 1 1 1 1 1 1 1 1 1 1
symmnumber: 1
zpe: 723519.1 jmol-1
zpe.correction: 0.275574 hartree
zpe.thermalcorrener: 0.291761 hartree
zpe.thermalcorrenthalpy: 0.292705 hartree
zpe.thermalcorrgfe: 0.230657 hartree
zpe.sumelectzpe: -764.605659 hartree
zpe.sumelectthermal: -764.589472 hartree
zpe.sumelectthermalent: -764.588528 hartree
zpe.sumelectthermalfe: -764.650576 hartree
dipole: -0.6906 2.1440 -0.3638
dipole: 2.2816
quadrupole: -101.0651 -133.1010 -99.6513
quadrupole: 4.6978 2.8999 -7.3426
quadrupole: 10.2074 -21.8286 11.6212 4.6978 2.8999 -7.3426
hfenergy: -764.881233 hartree
pointgroup: C01 [X(C15H16N2O1)]
dipole: -0.579432 0.6855622 0.0072513 debye
polarizability: 160.3955828|3.3850665|213.5117806|15.838515|11.997113|125.3275653 unknown
InChI: InChI=1S/C15H16N2O/c1-17-13-5-3-2-4-11(13)12-8-10(6-7-16)9-14(18)15(12)17/h2-5,10,12,15H,6,8-9H2,1H3
charge 0 multiplicity 1
34 atoms
O  -0.135184 3.73553 1.071053
N  -1.610032 0.991377 -0.023646
N  3.904776 -1.926882 -1.127903
C  0.006179 0.079471 1.553153
C  -0.777878 1.387792 1.152363
C  1.507408 0.124682 1.137618
C  1.678619 0.738875 -0.26898
C  -0.77205 -1.011624 0.81534
C  1.290836 2.239401 -0.222762
C  0.118896 2.554673 0.710694
C  -1.69085 -0.414758 -0.0909
C  3.134975 0.605552 -0.804901
C  -0.66714 -2.40637 0.904393
C  -2.693497 1.86711 -0.475693
C  -2.52819 -1.206354 -0.909025
C  -1.496521 -3.218185 0.083411
C  -2.414729 -2.615774 -0.807791
C  3.565723 -0.791512 -0.986506
H  -0.045282 -0.06255 2.647625
H  -1.420135 1.746815 1.984112
H  2.084046 0.725645 1.871718
H  1.913061 -0.903365 1.165422
H  1.005008 0.205169 -0.965855
H  1.035281 2.615679 -1.233167
H  2.142721 2.857165 0.126807
H  3.837213 1.099769 -0.103975
H  3.227947 1.130137 -1.776001
H  0.04256 -2.871036 1.59931
H  -3.625744 1.727597 0.114977
H  -2.922944 1.674574 -1.538719
H  -2.3810 2.920604 -0.383585
H  -3.248181 -0.755028 -1.599155
H  -1.426363 -4.309071 0.142989
H  -3.055826 -3.248405 -1.432519
