program: Gaussian 09
title: 000288590
version: EM64L-G09RevD.01
frameworkgroup: C1[X(C6H13NO3S2)]
method: RPBEPBE
basis: SDD
operation: Freq
keyword: #p
keyword: freq=noraman
keyword: PBEPBE/SDD
title: #p freq=noraman PBEPBE/SDD
converged: YES YES NO NO
title: Mulliken charges:
elementType: S S O O O N C C C C C C H H H H H H H H H H H H H
charge: 0.055311 0.986676 -0.611338 -0.530210 -0.524969 -0.069523 -0.365378 -0.356336 -0.443075 -0.446395 -0.361418 -0.742337 0.268985 0.259147 0.232897 0.226514 0.236843 0.224863 0.234458 0.230164 0.232840 0.305861 0.308502 0.280421 0.367498
chargesum: 0.00000
title: Mulliken charges with hydrogens summed into heavy atoms:
elementType: S S O O O N C C C C C C
charge: 0.055311 0.986676 -0.243840 -0.530210 -0.524969 -0.069523 0.162753 0.103075 0.018631 0.018227 0.177283 -0.153414
polarizability: 2.65584039e+02 9.80349098e+00 1.49051811e+02 6.89767747e+00 -3.06537350e+00 9.68596497e+01
1716.lowfreq: -4.9800 -0.0021 -0.0007 0.0017 3.6418 11.1692 21.3263 41.9645 60.6612
frequency: 16.9885 41.8620 60.2806 72.6166 90.3621 106.8777 131.7811 142.5160 158.4314 165.7132 185.2961 225.1929 227.8149 268.8136 292.1653 316.8995 357.5969 395.6424 473.4960 573.7952 594.7299 682.0087 762.3603 814.1001 819.8366 848.9924 857.0887 886.9545 895.6234 904.6362 912.7722 947.5706 990.0843 995.1200 1050.6981 1094.9209 1097.5844 1143.6597 1158.8102 1194.2113 1207.6099 1226.2028 1234.3992 1249.6197 1286.0671 1303.1439 1308.1387 1338.7066 1349.7680 1384.5474 1402.9890 1470.0410 1472.7466 1474.4768 1481.8947 1488.9539 2930.7668 2960.4885 2975.2768 2992.9513 2997.8427 3009.2877 3016.8334 3024.1824 3058.8162 3079.3562 3083.9900 3096.6820 3473.4515
redmass: 5.5349 3.4980 3.6826 6.8296 11.4294 5.4023 2.7563 4.3594 2.3986 1.8764 4.2187 3.5788 1.8298 5.7566 5.8640 3.2607 2.6618 16.5900 17.9933 1.8606 3.9449 2.6657 1.8615 1.7669 14.4827 2.0612 2.0772 2.7381 5.0633 1.8275 1.8985 1.6724 1.5618 1.7473 2.0750 1.5008 1.5977 1.3583 1.3444 1.7793 1.3505 1.2072 1.2467 2.0733 1.2815 1.3637 1.2389 1.3588 1.5425 1.3553 1.0783 1.0863 1.0870 1.0791 1.0855 1.0895 1.0607 1.0631 1.0977 1.0603 1.0563 1.0788 1.0640 1.0840 1.1036 1.1073 1.1003 1.1047 1.0665
irintensity: 0.9180 1.4243 1.3067 0.6649 4.1670 6.8438 2.9834 16.5867 41.1065 59.4757 2.9703 18.3043 1.0001 4.2100 20.3881 10.4847 2.2404 54.2457 133.8227 1.8787 1.6012 19.5230 18.9042 20.0236 101.7006 7.2965 5.3053 47.8256 26.9461 1.9788 2.2196 5.8873 6.6296 77.6902 5.4526 4.6595 5.4381 11.0649 1.2491 35.8699 4.6361 1.1195 8.7805 7.6127 0.6754 6.1593 0.0782 62.5686 46.0065 5.0843 10.3726 11.5139 24.6838 18.6657 10.9317 2.0268 62.9301 2.6303 18.6469 34.3374 11.3620 15.4897 40.0213 27.6651 1.7780 5.6494 38.3004 37.9971 46.0867
temp: 298.150 k
press: 1.00000 atm
elementType: 16 16 8 8 8 7 6 6 6 6 6 6 1 1 1 1 1 1 1 1 1 1 1 1 1
symmnumber: 1
zpe: 504436.1 jmol-1
zpe.correction: 0.192130 hartree
zpe.thermalcorrener: 0.207654 hartree
zpe.thermalcorrenthalpy: 0.208599 hartree
zpe.thermalcorrgfe: 0.147062 hartree
zpe.sumelectzpe: -1311.811915 hartree
zpe.sumelectthermal: -1311.796391 hartree
zpe.sumelectthermalent: -1311.795447 hartree
zpe.sumelectthermalfe: -1311.856984 hartree
dipole: 7.0679 1.6152 1.8462
dipole: 7.4815
quadrupole: -89.9202 -85.4172 -88.5829
quadrupole: 0.8883 -6.4537 -4.2232
quadrupole: -1.9468 2.5562 -0.6094 0.8883 -6.4537 -4.2232
hfenergy: -1312.0040451 hartree
pointgroup: C01 [X(C6H13N1O3S2)]
dipole: -2.6532434 -0.7944035 0.9965104 debye
dipolederiv: -0.039778 0.2773261 -0.0505105 0.6879773 -0.2095987 -0.0478813 -0.1316919 0.0900988 -0.1777294 1.0503538 -0.0344321 -0.0557857 0.3800395 1.4992934 0.0111505 -0.2373654 0.0755045 1.2552991 -0.1358692 0.242276 0.0303902 -0.3121918 -0.8551881 -0.1272309 -0.2521592 -0.3558053 -0.6885953 -0.8685329 -0.1414122 0.1128448 -0.4637476 -0.5914846 0.1016763 0.2345224 0.0783811 -0.478596 -0.3193321 0.0188665 -0.138539 -0.2156237 -0.4899623 0.1034099 0.3386048 0.1551728 -0.6371036 -0.7767272 -0.04734 0.10368 0.2210403 -0.1974389 -0.0379705 0.2673797 0.0022758 -0.3803321 0.4436607 -0.0693311 -0.0189743 -0.1996619 0.1746321 -0.0118754 -0.1695023 -0.0116699 0.1787528 0.5640385 0.1568433 -0.1660213 0.0734431 0.1877369 0.0563034 0.1480877 0.0780411 0.2067429 0.0901841 -0.0341571 -0.0425346 0.0051607 0.0568873 0.0072768 -0.0383428 0.0220233 0.1504963 0.1259346 0.0038064 -0.0731552 -0.0485512 -0.0096431 0.0366275 0.0230461 0.0402711 0.095919 0.1844992 -0.0521452 -0.0021936 -0.269344 0.0090253 -0.0078031 -0.4945913 -0.274672 0.3613829 -0.1189909 -0.1786718 0.0501478 0.1894459 -0.0344415 -0.0595115 0.3051056 0.1185343 -0.0816713 -0.0836476 0.0008097 0.0761098 0.1446218 0.0372617 -0.02694 -0.0459599 0.0052103 -0.004842 -0.1109074 -0.0682731 -0.0367453 0.0406459 -0.0095934 -0.0488688 -0.0531178 -0.0646274 0.0253733 -0.1722852 -0.0622009 0.0887306 -0.0864815 0.0508905 0.0146784 0.0814864 0.060024 -0.1279381 -0.1113159 0.0775762 0.0369633 -0.0414317 -0.1385535 -0.0257913 -0.1323808 -0.0675291 0.0684709 0.0376515 0.0200104 -0.0254413 0.079827 -0.0031189 0.0899742 -0.1030994 0.111839 -0.0448324 -0.0245835 0.0465617 0.0527642 -0.0024506 0.0194597 -0.0634956 0.1339954 -0.1053994 -0.0622529 -0.2109867 -0.0611895 0.0092028 -0.0626413 0.0700873 -0.0002862 0.0330156 0.0138009 0.0840119 0.0826721 0.0378178 0.0662719 0.0428436 0.0197392 -0.0544604 -0.0203227 -0.0681646 -0.114902 0.0722528 0.0274292 0.0272453 0.0331538 0.0125394 0.1202406 0.0972515 0.0968222 -0.0959594 0.0147312 0.0081466 -0.0360063 -0.024904 0.0154268 -0.0323421 0.0844612 0.0111789 0.0729954 0.0004772 -0.0391611 -0.0351208 0.0246096 0.1202826 0.0471108 -0.0169482 0.0204136 -0.0392689 0.1224598 -0.0804892 -0.0056929 -0.1142871 0.0027877 -0.0002777 -0.077292 -0.0194638 0.1409393 0.1840411 -0.0486666 0.0323698 -0.0814921 0.2629731 -0.0437133 0.0258174 -0.0122604 0.2936394 unknown
polarizability: 260.1052047|23.1959|151.0513976|-14.9416621|-13.7393403|100.3388969 unknown
InChI: InChI=1S/C6H12NS.HO3S/c8-6-5-7-3-1-2-4-7;1-4(2)3/h1-6H2;1H
charge 0 multiplicity 1
25 atoms
S  2.246051 -1.512478 0.310362
S  2.247494 0.980953 -0.502593
O  1.379674 2.032087 0.880707
O  3.731124 1.605627 -0.6951
O  1.205715 1.060163 -1.748884
N  -1.667163 -0.263636 0.594008
C  -1.820636 1.002782 -0.155133
C  -2.837331 -1.150404 0.461549
C  -3.339597 1.065567 -0.431058
C  -3.741921 -0.429386 -0.571793
C  -0.395903 -0.696451 1.12857
C  0.404219 -1.578054 0.083044
H  -1.224278 0.98771 -1.091554
H  -1.430935 1.848183 0.444642
H  -3.346754 -1.268368 1.443036
H  -2.537005 -2.166206 0.128969
H  -3.574107 1.653751 -1.333291
H  -3.864073 1.525187 0.426428
H  -4.814048 -0.6051 -0.384173
H  -3.508804 -0.788988 -1.590501
H  -0.537417 -1.289041 2.051912
H  0.193575 0.200957 1.385631
H  0.167161 -1.279232 -0.95436
H  0.121368 -2.638236 0.220322
H  2.056293 2.706714 1.18156
