program: Gaussian 09
title: 000288596
version: EM64L-G09RevD.01
frameworkgroup: C1[X(C19H18N2O2)]
method: RPBEPBE
basis: SDD
operation: Freq
keyword: #p
keyword: freq=noraman
keyword: PBEPBE/SDD
title: #p freq=noraman PBEPBE/SDD
converged: YES YES NO NO
title: Mulliken charges:
elementType: O O N N C C C C C C C C C C C C C C C C C C C H H H H H H H H H H H H H H H H H H
charge: -0.448601 -0.244898 -0.441011 -0.011875 0.411720 0.056324 -0.693542 -0.572085 0.466704 0.038067 -0.070463 -0.349188 0.300999 -0.399091 -0.465207 -0.338966 -0.344843 -0.231273 -0.229587 -0.239494 -0.226609 -0.250476 -0.228997 0.234568 0.233275 0.208772 0.250240 0.335076 0.205184 0.263717 0.310395 0.240478 0.297025 0.203628 0.232555 0.230156 0.232584 0.234171 0.229583 0.233462 0.337523
chargesum: 0.00000
title: Mulliken charges with hydrogens summed into heavy atoms:
elementType: O O N N C C C C C C C C C C C C C C C C C C C
charge: -0.111078 -0.244898 -0.105935 -0.011875 0.411720 0.056324 -0.225699 -0.113073 0.466704 0.038067 -0.070463 0.119713 0.300999 -0.088696 -0.224729 -0.041941 -0.141215 0.001282 0.000569 -0.006910 0.007562 -0.020893 0.004465
polarizability: 2.62480678e+02 2.83380496e+01 2.79061683e+02 -3.69798373e+00 4.02392675e+00 1.43581727e+02
1716.lowfreq: -8.0960 -3.1889 -2.7443 -0.0008 -0.0007 -0.0006 20.3975 26.0253 30.4495
frequency: 20.1815 26.0141 30.4405 50.8829 55.8880 64.4925 92.6349 109.9552 118.4559 166.7034 169.4012 199.6632 217.1456 238.2294 287.1985 288.5429 315.1485 340.5198 368.7526 384.0915 398.8237 407.8913 455.1520 458.8629 505.4162 520.6778 538.0771 552.6302 580.0152 615.5757 616.3569 636.3218 650.7757 677.8056 685.0282 703.8779 714.0560 721.7076 762.5789 777.4127 793.9725 823.5919 826.7155 849.3756 871.1932 888.6291 914.5376 927.5879 933.2498 946.3897 956.2193 985.7111 988.4365 988.8467 990.6066 1010.1971 1013.6333 1022.1697 1026.0681 1027.7723 1034.5069 1056.9818 1084.9253 1089.5166 1136.1316 1154.4456 1173.3278 1173.8315 1179.1169 1194.7413 1196.9647 1204.0457 1229.0427 1241.4995 1297.2899 1306.5166 1319.3232 1321.2953 1334.3823 1337.1369 1340.9203 1369.7723 1381.5748 1387.0649 1427.4370 1441.4283 1443.5326 1453.7060 1460.0567 1473.1860 1484.0158 1484.6594 1545.1903 1566.4760 1591.0290 1596.5073 1611.6489 1613.4162 1642.4585 2980.6581 2982.9501 2996.3784 3053.0284 3090.5955 3109.2788 3109.3274 3110.2854 3118.7301 3132.7016 3133.2988 3145.5305 3146.9269 3161.9135 3163.5804 3172.7235 3514.6507 3563.2654
redmass: 3.9032 5.1142 5.0286 5.5577 4.3742 5.2920 5.4755 6.1710 5.7669 2.8229 4.8659 4.5578 5.1059 3.8863 5.8810 1.2549 6.1439 1.9092 4.2392 2.7011 2.7802 2.8960 3.7765 3.7898 3.8921 4.4350 5.7324 5.5128 3.7216 6.4152 6.3422 3.4705 1.6195 4.3101 4.6905 1.5159 2.7148 2.5246 2.0255 4.1062 2.9112 3.8433 3.1007 1.2614 1.2493 5.4797 1.8771 2.1113 1.4763 1.6062 2.6719 1.4495 4.9228 4.8551 1.4257 2.4808 1.3876 1.6622 2.3230 2.3404 2.0049 2.3912 1.6056 1.6110 1.5193 3.7048 1.0874 1.0667 1.3789 1.1556 1.1541 2.1574 2.5996 1.2569 1.7344 1.6128 1.8888 1.3297 1.5520 1.2812 1.7186 1.2784 7.6158 8.6129 2.7538 1.4464 1.5179 1.7167 1.6464 1.0914 2.2186 2.3231 3.9886 7.7321 6.0068 5.4325 5.8918 5.9784 6.6772 1.0662 1.0687 1.0617 1.1009 1.0907 1.0887 1.0972 1.0882 1.0902 1.0899 1.0867 1.0952 1.0922 1.0963 1.1012 1.0995 1.0772 1.0664
irintensity: 0.1572 2.9425 0.3280 4.7136 0.2892 2.7133 0.7600 1.4876 6.9682 3.4468 3.0423 3.5152 4.0467 5.8280 3.1697 167.4311 5.7472 35.1891 4.4817 3.3456 0.2106 0.2536 4.7776 0.3575 10.9694 14.1857 7.4003 4.3150 2.0636 0.1081 0.5032 11.9681 19.9853 2.1415 0.8369 118.4146 25.0032 33.7613 43.7837 26.6787 11.9776 4.5160 12.3917 0.7283 2.1039 3.3101 6.2751 37.4187 4.0189 6.2519 14.1739 1.0870 0.3556 0.5747 0.3241 37.8378 10.0544 23.9155 10.2291 22.5845 8.9773 22.1688 10.8210 12.7651 17.5635 16.4618 0.7760 3.2229 3.0567 0.7442 9.0023 3.9219 10.7868 22.4887 37.1876 15.2207 19.2387 8.9210 2.8705 7.6909 9.4493 16.2792 0.3940 0.6568 26.1597 41.0437 31.5257 138.0345 68.9523 13.7092 10.1650 36.5976 440.0565 88.0219 1.7822 29.3526 19.1363 2.4547 168.8766 64.6216 18.0284 73.8575 7.7209 8.1879 25.6558 9.4201 8.9140 6.3054 3.8063 1.0602 21.8636 23.3894 12.5747 31.8346 22.1955 57.2402 4.4675
temp: 298.150 k
press: 1.00000 atm
elementType: 8 8 7 7 6 6 6 6 6 6 6 6 6 6 6 6 6 6 6 6 6 6 6 1 1 1 1 1 1 1 1 1 1 1 1 1 1 1 1 1 1
symmnumber: 1
zpe: 857562.3 jmol-1
zpe.correction: 0.326628 hartree
zpe.thermalcorrener: 0.346735 hartree
zpe.thermalcorrenthalpy: 0.347679 hartree
zpe.thermalcorrgfe: 0.275344 hartree
zpe.sumelectzpe: -993.153377 hartree
zpe.sumelectthermal: -993.133270 hartree
zpe.sumelectthermalent: -993.132325 hartree
zpe.sumelectthermalfe: -993.204661 hartree
dipole: -1.6990 6.6124 2.7914
dipole: 7.3758
quadrupole: -110.9812 -145.0621 -134.2233
quadrupole: 12.1303 -4.5028 -4.2140
quadrupole: 19.1077 -14.9733 -4.1344 12.1303 -4.5028 -4.2140
hfenergy: -993.4800048 hartree
pointgroup: C01 [X(C19H18N2O2)]
dipole: -0.4420551 -2.6106886 -1.1873013 debye
polarizability: 267.7766824|-29.373033|273.3258067|0.9595618|9.2764484|144.0215992 unknown
InChI: InChI=1S/C19H18N2O2/c22-12-11-16-17(13-14-7-3-1-4-8-14)20-18(21-19(16)23)15-9-5-2-6-10-15/h1-10,20,22H,11-13H2
charge 0 multiplicity 1
41 atoms
O  -3.889649 0.99392 1.209968
O  -0.553317 3.962398 0.487309
N  0.27287 0.139899 -0.576608
N  1.024407 2.250345 0.221552
C  -1.051246 0.570247 -0.737191
C  -1.366925 1.876021 -0.407466
C  -1.994063 -0.481209 -1.305372
C  -2.750332 2.479588 -0.47663
C  -1.882558 -1.831213 -0.595325
C  1.269459 0.985072 -0.100854
C  -0.298393 2.770486 0.12387
C  -3.494288 2.381109 0.879282
C  2.65088 0.439405 0.036647
C  -2.284881 -1.955299 0.761707
C  -1.363465 -2.965457 -1.269147
C  3.707191 1.358411 0.27467
C  2.949368 -0.947749 -0.050858
C  -2.168727 -3.195887 1.424269
C  -1.247674 -4.209169 -0.602792
C  -1.64931 -4.325917 0.746652
C  5.033749 0.903447 0.404304
C  4.279367 -1.401128 0.083044
C  5.326566 -0.477865 0.305803
H  -1.771841 -0.612878 -2.3839
H  -3.022612 -0.097626 -1.228679
H  -3.371477 2.037608 -1.278272
H  -2.625658 3.557464 -0.693387
H  0.480335 -0.84152 -0.776154
H  -4.385025 3.04164 0.87247
H  -2.827812 2.696694 1.695985
H  -2.684488 -1.075023 1.281287
H  -1.067872 -2.883232 -2.323506
H  3.448114 2.418199 0.357788
H  2.161618 -1.699439 -0.19012
H  -2.483495 -3.283907 2.470248
H  -0.852163 -5.080608 -1.136559
H  -1.562107 -5.286995 1.265567
H  5.839748 1.623063 0.583658
H  4.496254 -2.473054 0.021938
H  6.358109 -0.832339 0.408237
H  -4.688952 0.7543 0.676767
