program: Gaussian 09
title: 000027618
version: EM64L-G09RevD.01
frameworkgroup: C1[X(C16H20FNO)]
method: RPBEPBE
basis: SDD
operation: Freq
keyword: #p
keyword: freq=noraman
keyword: PBEPBE/SDD
title: #p freq=noraman PBEPBE/SDD
converged: YES YES NO NO
title: Mulliken charges:
elementType: F O N C C C C C C C C C C C C C C C C H H H H H H H H H H H H H H H H H H H H
charge: -0.196718 -0.214598 -0.314565 0.492758 -0.225593 -0.559332 -0.455006 -0.523677 -0.454546 -0.546788 -0.392081 -0.529758 0.113421 0.295867 -0.309655 -0.319583 -0.389427 -0.373214 0.332567 0.237895 0.229553 0.214381 0.212084 0.225108 0.235088 0.179674 0.183965 0.223686 0.190838 0.196267 0.250054 0.232332 0.227287 0.235352 0.236550 0.253600 0.284740 0.259423 0.262053
chargesum: 0.00000
title: Mulliken charges with hydrogens summed into heavy atoms:
elementType: F O N C C C C C C C C C C C C C C C C
charge: -0.196718 -0.214598 -0.064511 0.492758 0.012303 -0.115398 -0.017814 -0.108915 -0.046895 -0.159684 0.067538 -0.057855 0.113421 0.295867 -0.056055 -0.034843 -0.130004 -0.111161 0.332567
polarizability: 2.46009062e+02 -4.69654225e+00 1.65653977e+02 -1.26310658e-01 6.54996113e+00 1.20461584e+02
1716.lowfreq: -19.8504 -3.5631 -0.8823 -0.0009 -0.0007 0.0004 11.3255 22.6781 39.6809
frequency: 6.3606 22.4107 39.6477 51.8439 73.4856 96.6519 107.8470 128.2895 140.8813 162.1384 223.0037 229.3901 284.6464 310.7080 334.4713 339.4992 368.9920 379.2136 411.2463 416.1797 476.0350 479.0824 536.5647 564.9121 574.7663 578.6683 624.6393 649.1762 719.1634 730.7136 743.8995 750.0786 774.2030 806.1853 813.5557 816.9107 835.9817 844.8732 862.6567 897.7100 910.8494 954.6841 959.6003 964.6583 975.3196 988.2025 996.9584 1004.0058 1007.4171 1023.1947 1040.0487 1070.3815 1084.5094 1100.6292 1105.2729 1106.4198 1123.5620 1135.7361 1155.1929 1155.9876 1195.6245 1199.8232 1203.4691 1206.2968 1219.7131 1227.7920 1237.8393 1243.3011 1267.1152 1275.9700 1285.8383 1291.5926 1297.2670 1306.7581 1331.1970 1349.3194 1362.8541 1380.0415 1399.6491 1409.7114 1434.4344 1442.4672 1454.5635 1461.2399 1470.6336 1475.9469 1482.0540 1490.6370 1573.3882 1601.0485 1613.4162 2838.0354 2858.0569 2943.0783 2955.0339 2992.8035 3000.1155 3001.2035 3001.8933 3013.8165 3024.2449 3029.3825 3039.7382 3062.1989 3069.8278 3094.0966 3155.7029 3157.4220 3177.6351 3180.6859 3476.3042
redmass: 4.6064 4.2506 5.2394 4.1902 2.1874 5.5452 4.9336 3.1029 1.8455 4.5012 3.4861 3.9538 6.2583 2.3314 4.2841 2.7972 2.9002 3.1903 2.9460 2.7739 4.4585 3.1565 1.6269 2.2095 3.6645 7.2177 7.1571 3.3007 2.3987 1.5009 1.3906 5.4406 1.9650 3.7065 3.8316 1.3986 1.4124 2.5906 1.6524 2.2260 1.7646 1.4019 2.3390 2.6274 4.1866 1.3980 1.7323 2.6744 1.7126 2.1268 1.9855 2.2091 2.5556 1.6630 1.3198 1.8518 1.7972 1.5969 1.3687 1.3856 1.2353 1.8930 1.6080 2.1574 1.4767 1.4327 1.4121 1.3881 1.8485 1.7824 1.2851 1.2742 1.4615 1.3369 1.7065 1.5182 1.6916 5.8715 1.4352 4.1135 1.1033 1.0836 1.0950 1.0958 1.0796 1.0941 1.0961 2.5718 8.2145 7.1777 7.3685 1.0707 1.0705 1.0592 1.0598 1.0993 1.0787 1.0659 1.0713 1.0628 1.0877 1.0905 1.0886 1.1027 1.1049 1.1064 1.0884 1.0891 1.0964 1.0974 1.0760
irintensity: 0.2173 0.2222 0.0560 0.9116 0.9299 3.6724 0.1921 0.1931 0.0104 1.2677 4.2817 5.6243 0.8037 3.6052 0.6956 2.0022 0.9251 6.0712 0.0072 10.7162 8.3945 8.4192 112.0369 11.1176 0.8626 21.2190 0.7336 11.3887 2.2512 20.3514 12.0169 1.1113 17.3401 10.8922 7.4861 23.6965 32.2073 1.1142 25.3233 6.0607 1.5792 0.5923 4.0113 5.1055 57.9506 0.7902 0.3227 4.4454 0.7666 0.4292 2.4381 2.4722 0.2583 1.2410 11.8661 1.3675 4.9653 3.3428 53.8932 41.4754 1.7193 2.1132 11.4164 79.7609 10.6620 40.9557 5.5303 2.3794 132.4431 1.9713 5.4645 3.1475 2.6672 1.3933 69.1842 3.0663 2.6251 17.7379 5.9189 15.6847 13.0744 4.1749 9.9474 5.4996 3.4857 10.2892 4.8620 26.9315 114.3216 84.7662 51.4973 114.4393 142.3897 26.7181 35.5598 29.4891 12.3813 36.5997 14.2176 53.3264 66.6352 28.4668 32.2731 41.9125 0.3313 65.1443 7.2819 0.0943 4.2042 4.3569 0.8445
temp: 298.150 k
press: 1.00000 atm
elementType: 9 8 7 6 6 6 6 6 6 6 6 6 6 6 6 6 6 6 6 1 1 1 1 1 1 1 1 1 1 1 1 1 1 1 1 1 1 1 1
symmnumber: 1
zpe: 851332.0 jmol-1
zpe.correction: 0.324255 hartree
zpe.thermalcorrener: 0.342112 hartree
zpe.thermalcorrenthalpy: 0.343056 hartree
zpe.thermalcorrgfe: 0.274732 hartree
zpe.sumelectzpe: -850.064894 hartree
zpe.sumelectthermal: -850.047037 hartree
zpe.sumelectthermalent: -850.046093 hartree
zpe.sumelectthermalfe: -850.114418 hartree
dipole: -0.5266 -2.5710 -1.4318
dipole: 2.9895
quadrupole: -123.5156 -112.2718 -112.4321
quadrupole: 2.8996 6.5166 -1.4058
quadrupole: -7.4424 3.8014 3.6410 2.8996 6.5166 -1.4058
hfenergy: -850.3891493 hartree
pointgroup: C01 [X(C16H20F1N1O1)]
dipole: 0.2105536 1.1487871 -0.1390246 debye
polarizability: 245.9909928|-4.640825|163.8106445|-1.3706704|11.122098|122.3229859 unknown
InChI: InChI=1S/C16H20FNO/c17-14-5-3-12(4-6-14)15(19)2-1-8-16-9-7-13(16)10-18-11-16/h3-6,13,18H,1-2,7-11H2
charge 0 multiplicity 1
39 atoms
F  -6.99068 0.889242 0.117899
O  -1.273837 -1.958646 -0.456417
N  5.405783 -0.442604 -1.256123
C  3.536378 0.097931 0.109761
C  4.754915 1.075537 0.431431
C  3.917723 -0.756127 1.378892
C  5.095599 0.225724 1.703879
C  3.927549 -0.563522 -1.236608
C  5.728515 0.918638 -0.755259
C  2.124168 0.704712 0.117261
C  1.008955 -0.34723 -0.083694
C  -0.398531 0.266641 0.025391
C  -1.526851 -0.745102 -0.197308
C  -2.953903 -0.273791 -0.10497
C  -3.300011 1.07596 0.177216
C  -3.992128 -1.224609 -0.310788
C  -4.650389 1.474792 0.253488
C  -5.345586 -0.847413 -0.23867
C  -5.641537 0.499785 0.043033
H  4.492622 2.129675 0.626899
H  4.245395 -1.782941 1.145016
H  3.124127 -0.797959 2.146581
H  4.990571 0.772673 2.657004
H  6.093246 -0.243344 1.667407
H  3.622739 -1.624132 -1.298413
H  3.426157 -0.009313 -2.072211
H  5.534208 1.725068 -1.50673
H  6.789278 0.982387 -0.449607
H  1.963852 1.228943 1.08344
H  2.052257 1.479257 -0.676668
H  5.858981 -0.70996 -2.137749
H  1.11605 -0.835184 -1.070416
H  1.113434 -1.154986 0.665347
H  -0.513576 1.09213 -0.708998
H  -0.533353 0.73601 1.022851
H  -2.519749 1.825569 0.339232
H  -3.705713 -2.258784 -0.527024
H  -4.937194 2.507782 0.469356
H  -6.156263 -1.564907 -0.393731
