program: Gaussian 09
title: 000288614
version: EM64L-G09RevD.01
frameworkgroup: C1[X(C16H14N2O6)]
method: RPBEPBE
basis: SDD
operation: Freq
keyword: #p
keyword: freq=noraman
keyword: PBEPBE/SDD
title: #p freq=noraman PBEPBE/SDD
converged: YES YES NO NO
title: Mulliken charges:
elementType: O O O O O O N N C C C C C C C C C C C C C C C C H H H H H H H H H H H H H H
charge: -0.272373 -0.256463 -0.214651 -0.201338 -0.216783 -0.215571 0.017286 0.099935 0.273873 0.410000 0.173961 0.222965 -0.516404 -0.460580 -0.496182 0.470929 -0.220169 -0.399106 -0.379913 -0.224816 -0.224833 -0.226681 -0.204325 -0.491862 0.312763 0.229934 0.229896 0.276766 0.313585 0.236553 0.238931 0.234767 0.234717 0.236891 0.284783 0.236056 0.255287 0.232172
chargesum: 0.00000
title: Mulliken charges with hydrogens summed into heavy atoms:
elementType: O O O O O O N N C C C C C C C C C C C C C C C C
charge: -0.272373 -0.256463 -0.214651 -0.201338 -0.216783 -0.215571 0.017286 0.099935 0.273873 0.410000 0.173961 0.222965 -0.203641 -0.000751 -0.219416 0.470929 0.093416 -0.162553 -0.140982 0.009951 0.009884 0.010210 0.080458 0.231653
polarizability: 4.09127197e+02 8.07327932e+00 2.24723120e+02 9.03903485e+00 -1.17239593e+01 1.35935323e+02
1716.lowfreq: -4.9044 -0.0006 -0.0005 0.0006 5.2682 6.0403 8.6835 15.2870 30.8023
frequency: 7.9704 15.0693 30.6952 34.3254 36.7992 45.7031 54.3464 76.2598 100.5154 107.4658 114.8253 135.5873 169.0587 183.4369 184.5203 195.6576 242.3719 277.5651 297.0619 312.5905 327.9730 344.3189 374.6083 401.4093 409.8402 447.8219 461.3054 479.2002 502.4596 541.6281 582.2433 599.4227 607.6108 616.8844 647.1613 672.6508 681.7623 702.9333 707.1064 721.8687 734.5434 743.0103 766.9229 825.8244 852.3123 854.7624 854.8993 884.6294 898.3228 901.6430 935.5911 936.5743 945.1595 953.4102 976.9608 979.4450 990.9951 1002.6190 1026.0610 1059.4263 1091.0094 1105.9673 1138.6420 1166.7868 1175.7156 1177.3724 1188.9838 1197.6335 1198.3331 1217.0522 1228.2595 1232.6383 1259.2252 1278.1366 1289.6661 1327.5325 1347.5265 1357.3012 1383.5506 1387.1276 1387.6809 1412.6877 1442.6987 1444.1876 1458.2017 1460.5281 1477.5204 1486.5917 1499.6771 1544.2707 1596.9677 1605.2242 1616.8757 1625.7770 2979.3748 3010.8782 3045.3543 3123.9626 3124.5156 3126.2113 3139.6285 3144.3508 3153.0267 3163.7265 3168.9680 3172.0656 3188.6999 3197.5659
redmass: 4.3210 4.5007 3.7997 8.7412 6.4059 8.0620 6.9515 9.1082 6.2411 4.6444 6.4404 4.0774 1.5824 4.2241 3.8827 4.6965 5.4557 4.3006 4.9709 7.0048 6.8300 2.3707 5.9557 2.8089 5.4414 7.3942 3.6229 5.1074 4.5619 7.6233 5.7630 5.8059 6.3784 6.3381 6.1898 8.4009 7.0657 1.8887 7.6580 3.7623 7.1627 3.8614 2.5101 5.0884 1.8764 1.3544 3.0461 1.6463 2.6631 1.9647 1.7990 2.7563 4.6266 1.5290 1.5732 1.3963 6.2708 1.3241 2.1847 3.6718 1.5112 1.2421 1.6984 3.1273 1.0553 2.3510 1.1358 2.4123 1.4267 7.3042 1.8962 1.9384 1.4294 2.2282 2.1900 1.2710 8.1893 1.4146 4.9429 4.2358 7.9197 7.8260 2.1753 1.3295 1.0535 1.0547 1.1912 2.4357 3.1126 7.8895 6.0933 7.2288 6.1788 6.0541 1.0562 1.0292 1.1084 1.1033 1.0885 1.0877 1.0913 1.1063 1.0961 1.0902 1.1016 1.0915 1.0901 1.0949
irintensity: 0.5411 1.2319 2.5683 0.1128 0.4966 0.2753 1.0764 1.1828 9.8787 0.8296 4.0211 2.3656 2.4002 0.5826 0.1072 2.7553 3.8055 1.9865 2.2242 1.4942 0.9703 2.0223 5.8086 0.0080 2.6597 2.4455 1.6518 3.7780 18.0795 1.4439 1.8803 27.8694 14.3668 0.1087 25.2328 2.5715 1.0385 43.3062 2.0469 3.3523 6.8818 60.1864 37.2985 22.9277 25.6427 0.3942 3.4641 2.0922 86.0807 37.6013 20.9417 117.4170 105.2779 47.2292 4.9532 0.2801 1.9231 0.0101 3.9080 43.0512 6.5515 2.7290 48.6791 221.2101 0.0257 116.9820 16.1040 271.5016 88.6051 633.4683 15.6813 93.8522 30.7578 237.9230 85.9454 0.4540 116.3770 37.8975 81.9190 91.0594 3.7398 6.3363 9.8582 0.8404 22.3556 24.3725 68.6328 0.0588 269.4833 135.7171 0.8812 154.4869 0.7010 62.1298 24.0756 55.8768 16.2181 20.2392 10.5270 4.3334 9.8193 17.3547 30.3164 5.6731 21.8011 0.4223 8.3761 11.6348
temp: 298.150 k
press: 1.00000 atm
elementType: 8 8 8 8 8 8 7 7 6 6 6 6 6 6 6 6 6 6 6 6 6 6 6 6 1 1 1 1 1 1 1 1 1 1 1 1 1 1
symmnumber: 1
zpe: 724463.4 jmol-1
zpe.correction: 0.275934 hartree
zpe.thermalcorrener: 0.298323 hartree
zpe.thermalcorrenthalpy: 0.299267 hartree
zpe.thermalcorrgfe: 0.218684 hartree
zpe.sumelectzpe: -1177.008957 hartree
zpe.sumelectthermal: -1176.986568 hartree
zpe.sumelectthermalent: -1176.985623 hartree
zpe.sumelectthermalfe: -1177.066206 hartree
dipole: -12.5377 -3.3193 -0.5599
dipole: 12.9817
quadrupole: -172.8191 -151.9677 -131.3528
quadrupole: 0.5569 -0.1708 1.2405
quadrupole: -20.7726 0.0788 20.6938 0.5569 -0.1708 1.2405
hfenergy: -1177.2848903 hartree
pointgroup: C01 [X(C16H14N2O6)]
dipole: 4.9395988 1.2877401 0.1657691 debye
polarizability: 409.1624458|9.6612757|209.596289|-7.1378653|35.2874363|151.0269057 unknown
InChI: InChI=1S/C16H14N2O6/c1-23-15-9-13(7-8-17(19)20)14(18(21)22)10-16(15)24-11-12-5-3-2-4-6-12/h2-10H,11H2,1H3
charge 0 multiplicity 1
38 atoms
O  1.851464 0.314833 0.100849
O  0.133878 2.590718 0.731201
O  -1.358528 -3.303831 -1.169671
O  -3.427715 -2.614179 -0.510922
O  -6.79543 1.673491 1.219712
O  -6.665633 0.168679 -0.503343
N  -2.165173 -2.400466 -0.708073
N  -6.130258 0.89669 0.420597
C  0.46488 0.188171 0.016052
C  -2.422685 0.048558 -0.051057
C  -0.327629 1.345513 0.341828
C  -1.603744 -1.076652 -0.376941
C  -0.194523 -0.999897 -0.34902
C  2.682124 -0.887109 -0.23388
C  -1.734714 1.239336 0.29599
C  4.129343 -0.494438 -0.077727
C  -3.891834 0.058277 -0.138753
C  4.879908 -0.060496 -1.198919
C  4.752076 -0.545187 1.195194
C  6.232353 0.320321 -1.051619
C  6.102922 -0.162417 1.345871
C  6.845304 0.270873 0.222012
C  -4.680564 0.880004 0.608139
C  1.530821 3.040348 0.522655
H  0.354732 -1.9093 -0.600382
H  2.450315 -1.193716 -1.272156
H  2.398654 -1.702671 0.459658
H  -2.294816 2.156211 0.499018
H  -4.390311 -0.618799 -0.839197
H  4.405643 -0.022667 -2.187221
H  4.178701 -0.884135 2.066495
H  6.806251 0.649767 -1.924405
H  6.577312 -0.206736 2.332125
H  7.894951 0.562711 0.337502
H  -4.360038 1.544703 1.412031
H  1.505282 4.103667 0.803314
H  2.226043 2.478752 1.163449
H  1.824833 2.925981 -0.533806
