program: Gaussian 09
title: 000288580
version: EM64L-G09RevD.01
frameworkgroup: C1[X(C19H12N2O3)]
method: RPBEPBE
basis: SDD
operation: Freq
keyword: #p
keyword: freq=noraman
keyword: PBEPBE/SDD
title: #p freq=noraman PBEPBE/SDD
converged: YES YES NO NO
title: Mulliken charges:
elementType: O O O N N C C C C C C C C C C C C C C C C C C C H H H H H H H H H H H H
charge: -0.194300 -0.197548 -0.193301 -0.252444 -0.428613 -0.165807 -0.546777 0.157642 0.028465 0.099151 0.161765 0.250586 0.091289 0.110477 0.177541 0.181526 -0.401717 -0.367941 -0.249126 -0.354022 -0.353477 -0.206568 -0.211787 -0.210773 0.283637 0.273465 0.240434 0.324740 0.241098 0.240202 0.227107 0.269884 0.269871 0.227442 0.238943 0.238933
chargesum: 0.00000
title: Mulliken charges with hydrogens summed into heavy atoms:
elementType: O O O N N C C C C C C C C C C C C C C C C C C C
charge: -0.194300 -0.197548 -0.193301 -0.252444 -0.103873 0.117831 -0.032878 0.157642 0.028465 0.099151 0.161765 0.250586 0.091289 0.110477 0.177541 0.181526 -0.160619 -0.127739 -0.022018 -0.084138 -0.083606 0.020875 0.027156 0.028160
polarizability: 3.82371128e+02 2.67170145e+01 1.71574034e+02 1.33074101e+01 -1.74286259e+00 1.69979578e+02
1716.lowfreq: -5.7104 -2.8414 0.0006 0.0007 0.0008 1.9779 23.4447 29.3283 41.7590
frequency: 23.4373 29.3174 41.7558 94.9961 113.6904 118.2808 139.1218 163.5155 175.5813 181.5469 229.5663 241.8255 257.9063 306.0036 315.4409 336.8078 378.1925 416.1667 426.9910 455.2808 475.9194 486.2391 523.1527 553.2780 559.3953 564.7062 572.8590 592.3054 622.3158 636.5106 651.1662 658.7738 688.3575 706.0781 715.9420 751.3864 755.3990 761.1897 769.7234 788.6029 797.0073 812.4992 856.3264 866.2884 879.5096 907.2642 942.6112 952.7206 974.6951 978.6588 980.2893 1006.3251 1007.4181 1009.6809 1016.4212 1046.6951 1072.0841 1083.1777 1094.3147 1136.1196 1162.1016 1170.1969 1170.6798 1172.3863 1207.8403 1230.0763 1238.5228 1242.1806 1273.1469 1284.4816 1328.9136 1344.5716 1356.1501 1386.0046 1402.0777 1416.8033 1449.7308 1453.9825 1454.3586 1455.2833 1474.1712 1494.1986 1541.3175 1577.4197 1614.8430 1618.8392 1629.4474 1631.3609 1646.8402 1678.7049 3002.7006 3003.8413 3057.0324 3130.7768 3139.2279 3139.6127 3152.1245 3153.5996 3165.4810 3167.8580 3174.9545 3609.3178
redmass: 5.9658 7.0655 5.6362 7.8134 8.2901 6.2740 5.1329 8.7124 3.2487 6.0804 5.9502 7.2715 5.8076 4.4838 6.2112 10.4944 5.3653 3.4605 3.2976 4.8671 4.3697 5.4709 7.2154 7.0231 2.2671 1.7688 3.2019 4.9474 7.7194 6.0789 6.1140 4.8146 6.9124 5.1513 3.2307 4.9969 1.4331 4.1413 4.3013 5.1848 1.7577 5.0554 1.5119 5.0097 4.2991 1.4033 1.3961 4.4793 1.4138 2.2799 1.4927 1.3490 3.0327 2.1604 3.0292 2.7896 2.6546 4.2256 3.8240 1.7343 1.2789 1.1815 1.1343 1.9238 2.5311 1.4233 1.4600 2.0010 1.6214 1.4994 2.1204 4.2761 1.7330 3.4252 2.8508 6.1494 2.5726 2.4805 2.4780 1.5242 5.6311 3.5782 6.5251 6.0471 7.7079 7.9978 11.5051 7.5497 12.5503 12.3919 1.0610 1.0813 1.1028 1.0852 1.0892 1.0864 1.0958 1.0907 1.0956 1.1003 1.1003 1.0809
irintensity: 1.1732 0.8117 1.4953 1.4581 1.0784 1.8009 0.0313 1.2336 2.5196 1.1805 5.0888 0.3321 7.0515 2.5003 3.1181 20.4457 1.0677 5.0396 8.4338 0.0718 0.7880 37.9051 8.0374 5.6662 33.4751 51.0710 9.4254 9.2042 22.0836 1.8823 9.4820 0.0751 0.0366 12.8845 61.2615 18.6586 103.2080 2.1772 12.2475 0.2346 28.7537 12.4814 0.2979 18.7869 1.4561 0.0134 1.5142 0.8765 1.9438 30.2048 7.4606 0.0369 34.7627 2.3553 3.2729 4.1444 32.2853 30.6260 33.2380 23.5560 19.9618 1.2186 11.6787 7.7616 12.5386 62.7744 32.3624 16.7632 7.5438 0.8725 58.8214 313.5069 161.1584 4.9167 2.5927 13.7155 17.8020 7.6568 8.8262 13.0231 15.2664 7.3251 19.7631 2.9965 4.1505 92.2711 361.6969 28.2196 495.7230 38.9343 12.6334 30.0872 9.3985 0.0860 2.2379 1.8399 26.2718 6.1955 5.6452 34.4798 23.5673 81.6249
temp: 298.150 k
press: 1.00000 atm
elementType: 8 8 8 7 7 6 6 6 6 6 6 6 6 6 6 6 6 6 6 6 6 6 6 6 1 1 1 1 1 1 1 1 1 1 1 1
symmnumber: 1
zpe: 698032.9 jmol-1
zpe.correction: 0.265867 hartree
zpe.thermalcorrener: 0.283849 hartree
zpe.thermalcorrenthalpy: 0.284793 hartree
zpe.thermalcorrgfe: 0.218632 hartree
zpe.sumelectzpe: -1064.820630 hartree
zpe.sumelectthermal: -1064.802648 hartree
zpe.sumelectthermalent: -1064.801703 hartree
zpe.sumelectthermalfe: -1064.867865 hartree
dipole: -0.2569 -2.0474 -1.2028
dipole: 2.3884
quadrupole: -90.9459 -145.6046 -134.0277
quadrupole: -9.8530 -4.4797 2.3071
quadrupole: 32.5802 -22.0785 -10.5016 -9.8530 -4.4797 2.3071
hfenergy: -1065.0864967 hartree
pointgroup: C01 [X(C19H12N2O3)]
dipole: 0.1145904 -0.8179741 0.4481047 debye
polarizability: 383.2026447|-22.801919|170.4388288|13.9509702|1.8796939|170.2832666 unknown
InChI: InChI=1S/C19H12N2O3/c22-17-15(9-13-10-5-3-4-8-14(10)20-16(13)17)21-18(23)11-6-1-2-7-12(11)19(21)24/h1-8,15,20H,9H2
charge 0 multiplicity 1
36 atoms
O  -0.036109 1.464692 -2.037744
O  -2.645607 2.218577 1.246237
O  -1.000843 -1.739319 -0.702414
N  -1.499412 0.349751 0.32017
N  3.106233 0.675531 -1.494311
C  -0.147311 0.885536 0.41654
C  0.851752 0.063677 1.308073
C  2.134976 0.147971 0.516891
C  1.920492 0.676765 -0.761623
C  0.537708 1.054597 -0.993236
C  3.527101 -0.19794 0.608857
C  4.113827 0.145898 -0.67655
C  -2.663041 1.085113 0.708229
C  -1.833633 -0.903117 -0.272421
C  -3.825454 0.215176 0.346099
C  -3.329222 -0.975672 -0.239373
C  4.354145 -0.764902 1.617369
C  5.48435 -0.063012 -0.949557
C  5.716372 -0.972108 1.342289
C  -5.201453 0.43363 0.507685
C  -4.192955 -1.988146 -0.681604
C  6.273258 -0.623949 0.073011
C  -6.084141 -0.584785 0.062352
C  -5.587595 -1.777109 -0.522901
H  -0.267937 1.904351 0.835993
H  0.507254 -0.983489 1.393177
H  0.924803 0.479524 2.328688
H  3.211205 1.001126 -2.452957
H  3.934312 -1.035898 2.592006
H  5.922155 0.197332 -1.919009
H  6.366884 -1.407941 2.107969
H  -5.572851 1.358815 0.959087
H  -3.798339 -2.902811 -1.134853
H  7.339495 -0.799475 -0.107949
H  -7.165691 -0.449666 0.169609
H  -6.293429 -2.544324 -0.858629
