program: Gaussian 09
title: 000288562
version: EM64L-G09RevD.01
frameworkgroup: C1[X(C12H12N2O2)]
method: RPBEPBE
basis: SDD
operation: Freq
keyword: #p
keyword: freq=noraman
keyword: PBEPBE/SDD
title: #p freq=noraman PBEPBE/SDD
converged: YES YES NO NO
title: Mulliken charges:
elementType: O O N N C C C C C C C C C C C C H H H H H H H H H H H H
charge: -0.244432 -0.247432 -0.401187 -0.348713 -0.519785 -0.588162 0.328364 0.498689 0.113705 -0.290660 -0.423886 -0.390573 0.153204 -0.224848 -0.230569 -0.242988 0.212389 0.248400 0.211361 0.258145 0.265788 0.228492 0.247534 0.362681 0.349700 0.222839 0.224695 0.227252
chargesum: 0.00000
title: Mulliken charges with hydrogens summed into heavy atoms:
elementType: O O N N C C C C C C C C C C C C
charge: -0.244432 -0.247432 -0.038506 0.000987 -0.058997 -0.118656 0.328364 0.498689 0.113705 -0.024873 -0.195394 -0.143039 0.153204 -0.002010 -0.005874 -0.015736
polarizability: 2.22287289e+02 1.01877043e+01 1.44976071e+02 -1.29571942e+01 -3.41717005e+00 7.61872431e+01
1716.lowfreq: -16.5578 -2.5531 0.0007 0.0008 0.0010 5.3437 24.9521 28.9814 42.5951
frequency: 24.8491 28.0682 42.4435 75.5130 97.2237 150.3724 170.1622 241.3913 271.1686 338.5452 362.5498 371.9155 403.5312 411.3863 468.8576 505.7373 521.3127 574.8099 587.5643 617.4064 630.9172 701.3273 705.3166 719.5660 737.4817 757.7080 773.3454 783.0191 785.6108 837.4482 854.8852 897.7320 918.9666 940.1429 976.3832 989.2894 993.0513 993.3214 1005.7618 1026.5742 1076.3270 1115.9507 1164.9409 1171.7689 1184.0852 1186.9194 1217.1192 1224.0765 1266.7654 1277.2871 1323.0551 1330.4479 1339.7467 1365.4646 1382.4657 1386.2600 1440.8216 1441.3108 1458.7840 1482.1169 1484.6632 1592.8639 1612.3244 1614.1721 1655.1510 1683.2087 2990.6112 2999.8877 3043.8477 3069.5322 3112.3346 3116.9594 3130.9404 3142.5862 3161.3548 3164.4044 3524.8793 3566.5282
redmass: 4.8652 4.1462 6.1962 3.5321 5.8571 6.5629 8.2817 4.0429 2.7132 2.9490 7.7717 4.8557 2.8211 3.2676 6.4961 3.3480 7.3730 5.0405 5.2304 6.3419 1.2295 2.1968 1.9127 4.0488 3.2527 1.8688 1.4144 4.0370 2.8302 3.1894 1.2474 1.4549 1.4960 3.2083 1.3875 5.0017 1.9730 1.4125 3.8194 2.1876 1.6515 2.0416 1.9403 1.0654 1.5168 1.1164 2.4761 3.7025 1.4464 1.2141 1.3632 1.2802 2.0023 1.6621 7.6355 2.4244 2.1747 2.4565 1.1374 1.5186 1.4728 6.0528 6.4547 6.1691 6.3460 5.6736 1.0590 1.0604 1.1003 1.1047 1.0869 1.0870 1.0909 1.0959 1.1014 1.0945 1.0771 1.0786
irintensity: 1.0819 1.1643 0.0728 1.9900 0.9397 0.4276 3.4118 0.6143 2.5975 0.7133 19.7387 3.2886 0.0198 10.5234 18.9081 22.4041 8.2443 2.5705 3.2992 0.1062 90.2708 2.0711 44.3545 10.2598 13.8769 93.9148 6.0078 12.5696 88.7680 10.4850 0.0040 15.3614 2.1806 10.2345 0.0015 0.1896 1.4926 0.1513 0.4276 8.5265 10.4734 5.3601 22.6731 1.1795 98.4051 0.4915 0.6975 33.3570 14.5881 8.9447 2.7898 0.4765 48.0712 6.1158 0.4014 67.7039 7.3989 38.0461 3.9550 21.3022 12.9921 4.8891 123.0528 40.3617 173.9763 817.1543 5.2474 42.6249 0.2173 16.6293 9.8084 4.9128 11.3958 42.8044 26.9961 6.4648 56.2002 90.8218
temp: 298.150 k
press: 1.00000 atm
elementType: 8 8 7 7 6 6 6 6 6 6 6 6 6 6 6 6 1 1 1 1 1 1 1 1 1 1 1 1
symmnumber: 1
zpe: 578960.4 jmol-1
zpe.correction: 0.220514 hartree
zpe.thermalcorrener: 0.234230 hartree
zpe.thermalcorrenthalpy: 0.235174 hartree
zpe.thermalcorrgfe: 0.177554 hartree
zpe.sumelectzpe: -723.327372 hartree
zpe.sumelectthermal: -723.313656 hartree
zpe.sumelectthermalent: -723.312712 hartree
zpe.sumelectthermalfe: -723.370332 hartree
dipole: 1.1465 -4.0739 -1.1072
dipole: 4.3746
quadrupole: -106.8636 -84.8670 -95.9687
quadrupole: 6.2127 1.6941 0.3051
quadrupole: -10.9639 11.0328 -0.0689 6.2127 1.6941 0.3051
hfenergy: -723.5478859 hartree
pointgroup: C01 [X(C12H12N2O2)]
dipole: 0.455458 1.5522096 0.5877215 debye
polarizability: 222.0951949|-11.714686|145.0997732|12.5018775|3.0580369|76.2556348 unknown
InChI: InChI=1S/C12H12N2O2/c15-11-10(8-13-12(16)14-11)7-6-9-4-2-1-3-5-9/h1-5,8,13-14H,6-7H2
charge 0 multiplicity 1
28 atoms
O  -1.39933 -2.072616 -0.331109
O  -5.511106 0.177077 -0.357389
N  -3.42539 -0.915326 -0.33369
N  -3.58657 1.320249 0.345772
C  0.086475 0.263516 0.642741
C  0.927675 0.245756 -0.675584
C  -1.403047 0.255656 0.388069
C  2.41764 0.142787 -0.388186
C  -2.017981 -0.990696 -0.10873
C  -2.214556 1.346892 0.596078
C  3.257663 1.284684 -0.43106
C  2.99147 -1.107043 -0.034262
C  -4.271903 0.186786 -0.135003
C  4.635574 1.184209 -0.128719
C  4.366924 -1.212372 0.268467
C  5.19472 -0.065467 0.22375
H  0.369846 1.147081 1.245435
H  0.355769 -0.635469 1.228448
H  0.706373 1.162821 -1.253678
H  0.594045 -0.618948 -1.277652
H  -1.8192 2.29477 0.972287
H  2.831582 2.256757 -0.710912
H  2.35486 -2.00052 -0.008004
H  -3.877335 -1.76879 -0.67793
H  -4.169864 2.142421 0.509645
H  5.271234 2.076192 -0.172458
H  4.794632 -2.186019 0.533822
H  6.262703 -0.146386 0.455652
