program: Gaussian 09
title: 000288553
version: EM64L-G09RevD.01
frameworkgroup: C1[X(C11H12N2O2)]
method: RPBEPBE
basis: SDD
operation: Freq
keyword: #p
keyword: freq=noraman
keyword: PBEPBE/SDD
title: #p freq=noraman PBEPBE/SDD
converged: NO YES NO NO
title: Mulliken charges:
elementType: O O N N C C C C C C C C C C C H H H H H H H H H H H H
charge: -0.288282 -0.236539 -0.201043 0.018654 -0.401805 -0.538233 0.020156 0.410655 -0.356970 -0.365050 0.176645 -0.221828 -0.195877 -0.255165 -0.497756 0.247494 0.247347 0.260862 0.260912 0.238692 0.284054 0.224236 0.228254 0.229536 0.241412 0.241425 0.228214
chargesum: 0.00000
title: Mulliken charges with hydrogens summed into heavy atoms:
elementType: O O N N C C C C C C C C C C C
charge: -0.288282 -0.236539 -0.201043 0.018654 0.093036 -0.016458 0.020156 0.410655 -0.118277 -0.080997 0.176645 0.002408 0.032377 -0.025629 0.213295
polarizability: 2.92303662e+02 1.00127818e+00 1.37626837e+02 1.64777663e-02 -4.73431896e-02 6.71399891e+01
1716.lowfreq: -0.0010 -0.0008 -0.0006 1.0903 10.4567 12.0463 42.9195 52.9570 83.5108
frequency: 42.9159 52.9005 83.4952 95.5712 104.8094 118.5855 142.3625 182.0117 216.5518 265.3207 288.6572 302.7702 390.9325 410.0044 440.5293 493.2161 512.5015 515.9068 613.8552 665.5478 689.0657 694.4046 715.2358 759.9626 820.9208 822.6382 835.9173 852.4559 904.2044 945.1566 970.3618 980.7502 991.3781 994.1819 1010.3520 1030.4731 1038.7704 1056.5330 1085.6220 1114.6451 1130.9781 1146.8289 1148.0211 1172.3638 1187.0275 1220.1952 1226.0110 1282.7770 1317.5854 1328.3809 1386.3267 1396.4523 1426.7058 1450.0825 1451.4174 1462.6513 1466.0142 1484.4935 1493.6870 1516.2318 1588.8307 1612.9882 1634.1905 2994.9686 2998.1650 3029.0935 3048.2694 3084.2927 3096.4734 3128.6727 3138.0376 3141.1378 3152.9366 3166.3490 3182.9016
redmass: 5.1818 3.9773 4.8481 3.7816 1.2701 1.8536 2.6891 4.4787 5.1997 6.5861 5.9902 4.2970 4.6979 2.9226 7.6039 3.9201 3.2293 5.7325 6.4487 6.4948 5.1367 2.2652 6.0754 1.7016 5.8989 1.2674 1.2577 9.1149 1.4257 8.3071 1.3502 5.7888 4.1499 1.3101 3.7761 2.0395 1.6245 5.4222 1.8627 1.2657 3.0468 1.1742 1.5867 1.0521 1.1267 1.0974 2.0385 2.5431 1.4922 1.4456 6.1926 3.5556 1.2624 2.3966 1.0496 1.1710 1.0568 1.2722 2.1227 5.7231 6.5241 6.2742 10.3198 1.0576 1.0300 1.0615 1.1084 1.1044 1.1041 1.0849 1.0890 1.1043 1.0934 1.0988 1.0964
irintensity: 2.2862 1.1507 0.3981 2.0381 1.2365 1.4306 2.9208 6.2991 1.7220 2.3467 2.3882 12.1044 1.3947 0.0005 5.0043 2.8638 8.9449 1.5633 0.5951 29.4852 0.1174 50.4189 17.9198 83.2493 79.8244 0.9646 0.8779 1.2992 8.2694 8.1246 0.1315 1.2165 7.9195 1.2984 1.2814 1.1163 0.0096 491.7801 13.3063 0.0551 216.8297 1.5038 23.7806 0.6377 13.7074 0.1505 411.1160 104.5488 4.3991 8.5623 19.9771 63.2117 6.1734 13.9627 13.1265 12.9610 28.6977 132.0543 245.6023 226.3611 2.5998 142.7395 245.1128 36.6208 49.5967 15.3371 10.3493 16.5772 29.4690 5.6589 9.7362 20.7543 33.5046 24.1339 3.3303
temp: 298.150 k
press: 1.00000 atm
elementType: 8 8 7 7 6 6 6 6 6 6 6 6 6 6 6 1 1 1 1 1 1 1 1 1 1 1 1
symmnumber: 1
zpe: 555922.7 jmol-1
zpe.correction: 0.211740 hartree
zpe.thermalcorrener: 0.225485 hartree
zpe.thermalcorrenthalpy: 0.226429 hartree
zpe.thermalcorrgfe: 0.170163 hartree
zpe.sumelectzpe: -685.199047 hartree
zpe.sumelectthermal: -685.185302 hartree
zpe.sumelectthermalent: -685.184357 hartree
zpe.sumelectthermalfe: -685.240623 hartree
dipole: -0.1789 4.3684 0.0089
dipole: 4.3721
quadrupole: -71.0615 -85.0877 -89.7879
quadrupole: 5.1447 0.0097 -0.0344
quadrupole: 10.9176 -3.1087 -7.8089 5.1447 0.0097 -0.0344
hfenergy: -685.4107866 hartree
pointgroup: C01 [X(C11H12N2O2)]
dipole: -0.0571368 1.7174596 0.0763715 debye
polarizability: 292.2240327|-0.0024021|137.5016409|-4.4008209|2.8914119|67.344815 unknown
InChI: InChI=1S/C11H12N2O2/c1-15-11(14)10-7-8-13(12-10)9-5-3-2-4-6-9/h2-6H,7-8H2,1H3
charge 0 multiplicity 1
27 atoms
O  4.057475 0.330912 -0.110464
O  3.13433 -1.826216 -0.186802
N  -0.457921 0.493167 -0.016937
N  0.539414 -0.446435 -0.076638
C  0.056898 1.903573 0.034003
C  1.599957 1.698243 -0.003399
C  1.718369 0.174575 -0.072195
C  -1.818445 0.119374 -0.005829
C  -2.825749 1.120905 0.053321
C  -2.187346 -1.254461 -0.053021
C  2.97234 -0.582725 -0.129093
C  -4.186655 0.74653 0.064921
C  -3.549473 -1.607514 -0.040379
C  -4.559713 -0.615245 0.018477
C  5.394379 -0.2976 -0.164227
H  -0.290639 2.396365 0.960008
H  -0.323742 2.473806 -0.832627
H  2.105474 2.095521 0.892577
H  2.073063 2.173678 -0.878761
H  -2.557425 2.18165 0.090071
H  -1.40159 -2.012547 -0.098223
H  -4.955694 1.525809 0.110482
H  -3.825759 -2.667282 -0.0768
H  -5.616859 -0.900464 0.027853
H  5.507064 -0.886777 -1.090625
H  5.542204 -0.96554 0.701822
H  6.104042 0.541896 -0.141216
