program: Gaussian 09
title: 000288573
version: EM64L-G09RevD.01
frameworkgroup: C1[X(C12H15N3O4)]
method: RPBEPBE
basis: SDD
operation: Freq
keyword: #p
keyword: freq=noraman
keyword: PBEPBE/SDD
title: #p freq=noraman PBEPBE/SDD
converged: YES YES NO NO
title: Mulliken charges:
elementType: O O O O N N N C C C C C C C C C C C C H H H H H H H H H H H H H H H
charge: -0.274599 -0.205954 -0.214664 -0.275812 -0.101896 -0.416738 -0.409215 0.112588 -0.282175 -0.507092 -0.495465 0.150036 -0.179130 -0.197360 0.213357 0.193834 -0.500158 0.244609 -0.781558 0.300240 0.235096 0.260669 0.229152 0.256258 0.207280 0.208062 0.392375 0.349866 0.244995 0.233401 0.244865 0.273168 0.245757 0.246210
chargesum: 0.00000
title: Mulliken charges with hydrogens summed into heavy atoms:
elementType: O O O O N N N C C C C C C C C C C C C
charge: -0.274599 -0.205954 -0.214664 -0.275812 -0.101896 -0.024363 -0.059349 0.112588 0.018065 -0.011327 -0.010055 0.150036 0.028149 0.010702 0.213357 0.193834 0.223103 0.244609 -0.016423
polarizability: 1.96676910e+02 -4.31529631e+00 1.54219310e+02 1.12403768e+00 -1.10675408e+01 1.28414528e+02
1716.lowfreq: -62.4309 -15.4141 -7.5270 -2.9545 -0.0005 0.0003 0.0005 31.5579 53.5131
frequency: -62.4282 31.5520 53.5001 66.0737 80.6968 87.1315 93.6964 102.1419 135.4120 147.1844 174.1397 193.3068 214.9307 257.1313 281.7667 304.2106 309.9747 335.6109 362.6842 383.5408 428.0163 461.8536 490.0297 534.4480 540.5712 562.4842 569.6010 615.2747 655.2596 663.1527 692.6519 704.6018 732.9269 738.6572 754.8515 793.4910 829.5707 879.8680 895.1994 907.0923 935.6573 947.5590 955.7010 967.3160 973.8524 987.4189 1017.3433 1038.9324 1042.0766 1086.7510 1091.5719 1114.4769 1117.8481 1148.9060 1158.0349 1198.3916 1206.1473 1225.2456 1230.7702 1240.3478 1268.9249 1275.9328 1316.3782 1325.6092 1348.9878 1377.4068 1383.8071 1421.9819 1434.1056 1448.2468 1451.6970 1454.0318 1463.9981 1465.8780 1466.8635 1473.3602 1611.8440 1632.1235 1648.6360 1654.8259 1683.1667 2976.3124 2979.6954 2992.0071 2994.3279 3005.3418 3031.1130 3055.9461 3079.4810 3105.5547 3108.4543 3136.3077 3140.8567 3150.1830 3303.1879 3526.3132
redmass: 1.0364 5.3951 4.9090 4.9091 3.3391 3.9559 5.9228 1.1656 4.5574 4.9267 4.1166 5.0439 4.5668 3.7492 4.2374 4.9229 3.6537 5.4554 5.4922 2.2578 6.5415 6.1733 7.2373 4.7482 6.6452 4.7487 3.2218 3.5126 1.5008 2.5744 4.6805 4.6459 1.7499 5.5272 5.0323 3.3562 2.6516 1.4991 2.6581 3.1763 3.9952 3.8118 2.9963 1.9294 1.6451 1.8158 2.8788 1.6779 2.9922 1.7096 3.9805 1.2669 2.3348 1.4349 2.6271 1.3547 2.0116 2.2156 1.4766 1.5162 2.1225 1.7922 2.1024 1.6425 1.4809 1.6311 1.2318 1.1776 1.4923 1.1065 1.0508 1.0840 1.0549 1.0981 1.5259 2.1952 5.9373 7.7093 10.1114 5.7235 6.4923 1.0669 1.0660 1.0765 1.0384 1.0294 1.0981 1.0930 1.0981 1.0842 1.1046 1.0996 1.0985 1.1050 1.0807 1.0772
irintensity: 0.3192 1.6446 0.3857 6.0466 0.5048 0.7688 0.2785 0.2560 4.9868 9.8018 1.2736 2.0808 2.2968 5.2882 3.7205 10.1006 4.3935 4.2024 10.2352 1.7483 11.5323 4.9387 0.8605 3.8300 13.1091 6.0733 0.2085 5.0623 36.0692 20.9471 8.6997 21.9245 85.5715 38.5079 11.6292 6.7469 10.1890 77.7005 26.2686 8.5726 13.5916 8.4084 12.4512 3.6980 2.7281 23.8680 4.2547 6.2699 84.4704 1.4481 43.9571 0.1803 46.1879 15.0119 155.1766 22.3837 1.9428 46.5972 20.3134 51.3186 158.8671 37.2926 45.5377 8.5843 3.9751 1.3181 48.8970 15.8157 154.8889 16.3958 9.8586 40.4677 15.2707 43.6212 169.9477 269.2233 240.6386 362.4386 203.9841 293.3543 7.3624 12.0013 37.2770 11.2067 3.8003 34.2952 4.5439 4.2330 9.3721 5.8990 21.4197 54.6319 4.6475 13.6155 300.0705 37.5453
temp: 298.150 k
press: 1.00000 atm
elementType: 8 8 8 8 7 7 7 6 6 6 6 6 6 6 6 6 6 6 6 1 1 1 1 1 1 1 1 1 1 1 1 1 1 1
symmnumber: 1
zpe: 693484.3 jmol-1
zpe.correction: 0.264134 hartree
zpe.thermalcorrener: 0.281780 hartree
zpe.thermalcorrenthalpy: 0.282724 hartree
zpe.thermalcorrgfe: 0.217839 hartree
zpe.sumelectzpe: -930.029625 hartree
zpe.sumelectthermal: -930.011980 hartree
zpe.sumelectthermalent: -930.011036 hartree
zpe.sumelectthermalfe: -930.075921 hartree
dipole: 1.0730 -4.8276 -0.4022
dipole: 4.9618
quadrupole: -96.9322 -116.4180 -109.7284
quadrupole: -15.8502 12.4501 10.4658
quadrupole: 10.7607 -8.7252 -2.0355 -15.8502 12.4501 10.4658
hfenergy: -930.2937596 hartree
pointgroup: C01[X(C12H15N3O4)]
dipole: -1.1679953 1.4475418 -0.5925644 debye
polarizability: 192.9088701|11.6115314|161.3139971|-6.510315|1.2258581|125.0878807 unknown
InChI: InChI=1S/C12H15N3O4/c1-7(16)13-11-14-9(17)8-5-3-4-6-12(8,15-11)10(18)19-2/h3-4,8,13-14H,5-6H2,1-2H3
charge 0 multiplicity 1
34 atoms
O  1.261881 1.951602 -1.669027
O  0.847059 -3.055936 -0.37877
O  1.487017 2.927389 0.425142
O  -3.529682 -2.54525 0.179347
N  -0.82902 0.729999 0.207536
N  -0.973014 -1.680083 0.037181
N  -2.923218 -0.285706 0.195165
C  0.660322 0.582291 0.249394
C  1.152958 -0.606921 -0.63715
C  1.110673 0.396235 1.72653
C  2.681631 -0.820958 -0.571115
C  0.378703 -1.892342 -0.29406
C  2.559964 -0.037433 1.837254
C  3.261197 -0.577543 0.808096
C  1.196347 1.937558 -0.276184
C  -1.506543 -0.386269 0.141276
C  1.66302 3.243847 -2.276722
C  -3.863033 -1.3193 0.207732
C  -5.311207 -0.859291 0.2641
H  0.873874 -0.370028 -1.684634
H  0.450356 -0.351821 2.211248
H  0.953763 1.350437 2.259709
H  3.180564 -0.161557 -1.30893
H  2.894089 -1.861151 -0.884615
H  3.04225 0.104191 2.813185
H  4.311916 -0.860529 0.955526
H  -1.631953 -2.477557 0.111891
H  -3.239623 0.686031 0.261143
H  0.935209 4.027694 -2.008263
H  1.666535 3.05701 -3.359578
H  2.66299 3.539511 -1.917539
H  -5.962931 -1.744154 0.254513
H  -5.561116 -0.219799 -0.602067
H  -5.509278 -0.279969 1.184586
