program: Gaussian 09
title: 000288566
version: EM64L-G09RevD.01
frameworkgroup: C1[X(C14H16O5)]
method: RPBEPBE
basis: SDD
operation: Freq
keyword: #pfreq=noraman
keyword: PBEPBE/SDD
title: #p freq=noraman PBEPBE/SDD
converged: YES YES NO NO
title: Mulliken charges:
elementType: O O O O O C C C C C C C C C C C C C C H H H H H H H H H H H H H H H H
charge: -0.270479 -0.270814 -0.191980 -0.276941 -0.241688 -0.174844 0.373896 0.440249 -0.330703 -0.388725 -0.435901 -0.327325 -0.151953 0.233595 -0.807934 -0.324493 0.237269 -0.505134 -0.505791 0.251975 0.255833 0.252576 0.228320 0.231915 0.300429 0.222816 0.230616 0.229259 0.260623 0.248638 0.248542 0.236975 0.243922 0.233935 0.243322
chargesum: 0.00000
title: Mulliken charges with hydrogens summed into heavy atoms:
elementType: O O O O O C C C C C C C C C C C C C C
charge: -0.270479 -0.270814 -0.191980 -0.276941 -0.241688 0.077131 0.373896 0.440249 -0.074870 -0.136148 -0.207580 -0.095410 0.148476 0.233595 -0.125243 -0.063871 0.237269 0.229021 0.215388
polarizability: 2.58860339e+02 2.43232222e-01 1.43527707e+02 4.38763336e+00 -2.01978350e+01 1.31388774e+02
1716.lowfreq: -4.7006 -0.0009 -0.0006 -0.0004 1.5764 5.3093 16.7494 26.6381 41.1462
frequency: 16.2927 26.5082 41.1410 41.7807 46.3740 54.0912 68.9240 92.3217 97.6730 101.1024 114.2849 133.1958 165.1233 203.2266 208.3460 222.5708 246.6371 273.7747 302.1408 304.1215 335.1719 352.3953 396.2636 415.0140 437.8751 504.8810 515.6846 544.1808 633.7202 646.2783 662.3092 702.2388 708.7976 715.5815 740.0328 813.6585 817.1445 827.4908 832.3650 869.2346 900.6569 933.2866 936.3716 965.3126 977.3485 984.9471 1002.7523 1006.3529 1008.1891 1047.7803 1101.2634 1103.4877 1113.2591 1114.4779 1124.0955 1149.2697 1150.2459 1158.4922 1184.3718 1208.8680 1223.8956 1236.2327 1273.8553 1294.9566 1310.6405 1331.9928 1374.0647 1399.1226 1415.0601 1422.3413 1423.1637 1451.5581 1453.9050 1462.4267 1463.4993 1470.5896 1477.4098 1501.2671 1589.5623 1624.6623 1627.7070 1657.5032 1673.5137 2974.2908 3003.6872 3008.6234 3016.6156 3051.6669 3081.2384 3104.4309 3113.1237 3124.3119 3126.7756 3139.3990 3149.9131 3154.5887 3155.4654 3155.5773 3167.2931
redmass: 4.8768 4.5605 3.5070 1.6113 2.4245 3.9876 4.2853 1.6001 1.2430 1.4857 4.1695 4.8891 4.1650 4.8268 6.0026 2.8496 4.8220 3.9386 4.9482 4.3434 4.4787 3.2393 5.4018 2.9876 5.7163 2.7909 4.2999 5.1743 6.4985 4.9605 6.0705 5.1740 4.1561 4.9077 5.3242 1.6835 3.5205 2.5351 1.8532 5.8356 2.7655 2.8041 1.6869 1.3508 5.0185 1.5513 1.1472 4.5195 2.8665 1.5305 4.4760 3.1074 1.2691 1.2998 1.2791 1.4462 1.4285 3.3456 1.4452 2.0609 3.7221 1.4282 1.3237 1.3707 1.3002 1.4465 4.9142 1.2517 3.3199 1.1725 1.1852 1.0495 1.0493 1.0513 1.0508 1.0456 1.0978 2.5747 6.4296 6.5296 9.7323 8.7163 7.0650 1.0372 1.0298 1.0296 1.0848 1.0977 1.0986 1.1043 1.1050 1.0892 1.0892 1.0935 1.1046 1.0911 1.1035 1.0965 1.0954
irintensity: 0.9392 0.6575 0.8811 0.4346 0.5284 0.4559 0.1257 1.4672 0.1144 1.5899 0.4832 0.2926 5.4794 3.1597 1.2095 4.3152 2.0083 18.7744 7.9805 13.3781 3.5285 6.0199 11.7639 0.5650 1.6686 14.7738 7.6888 15.4760 0.4388 3.7849 6.9644 26.6647 4.1353 2.6900 16.8259 38.3514 19.7776 22.2244 5.9337 18.9499 6.3801 13.9893 5.5168 0.5429 78.2933 1.9528 65.1514 30.4705 41.4829 10.9853 245.0528 128.4748 0.2017 8.7702 25.4010 15.5192 12.1271 235.5460 75.0660 141.0077 13.6613 159.3197 16.7846 15.2545 12.9823 72.8055 6.5770 10.9580 0.6087 15.2979 24.4575 14.3736 15.8288 10.7758 12.5768 12.2444 12.7096 162.8696 16.2080 40.8007 126.4036 194.2413 48.4361 48.0126 36.4156 27.5248 14.6112 22.7010 19.4616 25.7992 21.1646 16.5665 24.6753 0.6308 17.6736 4.3519 19.1300 2.9682 3.9594
temp: 298.150 k
press: 1.00000 atm
elementType: 8 8 8 8 8 6 6 6 6 6 6 6 6 6 6 6 6 6 6 1 1 1 1 1 1 1 1 1 1 1 1 1 1 1 1
symmnumber: 1
zpe: 712296.7 jmol-1
zpe.correction: 0.271299 hartree
zpe.thermalcorrener: 0.291935 hartree
zpe.thermalcorrenthalpy: 0.292879 hartree
zpe.thermalcorrgfe: 0.217879 hartree
zpe.sumelectzpe: -917.759905 hartree
zpe.sumelectthermal: -917.739269 hartree
zpe.sumelectthermalent: -917.738325 hartree
zpe.sumelectthermalfe: -917.813326 hartree
dipole: 0.1459 2.1991 -3.6555
dipole: 4.2685
quadrupole: -87.5224 -98.8386 -119.1879
quadrupole: -2.2034 5.7419 -3.7350
quadrupole: 14.3272 3.0110 -17.3383 -2.2034 5.7419 -3.7350
hfenergy: -918.0312043 hartree
pointgroup: C01 [X(C14H16O5)]
dipole: -0.0212708 0.5829414 -1.5747889 debye
polarizability: 257.7519611|12.1790566|136.9308463|4.3813378|-20.7133799|139.094012 unknown
InChI: InChI=1S/C14H16O5/c1-10-4-6-11(7-5-10)19-12(14(16)18-3)8-9-13(15)17-2/h4-9,12H,1-3H3
charge 0 multiplicity 1
35 atoms
O  0.515129 -0.815014 0.67876
O  -0.641566 2.136412 -0.984378
O  -0.213822 1.977277 1.307374
O  -5.084649 -1.556149 -0.906124
O  -4.468549 -1.519624 1.348754
C  -0.501423 -0.0842 -0.077985
C  1.865225 -0.677157 0.272967
C  4.63923 -0.578758 -0.36779
C  2.307015 0.117135 -0.809655
C  2.793901 -1.421614 1.037487
C  3.689163 0.154848 -1.115491
C  4.16188 -1.367414 0.715702
C  -1.834921 -0.59306 0.412717
C  -0.413424 1.439305 0.203124
C  6.120921 -0.529902 -0.699892
C  -2.882535 -0.867355 -0.407249
C  -4.179352 -1.334086 0.141776
C  -0.68581 3.617307 -0.861342
C  -6.423996 -2.037402 -0.494663
H  -0.388172 -0.242657 -1.167078
H  1.611392 0.70714 -1.414747
H  2.425021 -2.026162 1.871572
H  4.02698 0.772859 -1.956132
H  4.874233 -1.946666 1.315859
H  -1.933814 -0.713346 1.499331
H  6.318494 0.118024 -1.571247
H  6.711965 -0.138527 0.149743
H  6.516343 -1.536471 -0.933702
H  -2.819949 -0.762113 -1.495641
H  0.286439 3.994429 -0.503161
H  -1.476609 3.913363 -0.152297
H  -0.904641 3.976682 -1.875968
H  -6.337265 -3.004599 0.028703
H  -6.986461 -2.142443 -1.432706
H  -6.902678 -1.306162 0.178481
