program: Gaussian 09
title: 000027594
version: EM64L-G09RevD.01
frameworkgroup: C1[X(C12H9ClN2O2)]
method: RPBEPBE
basis: SDD
operation: Freq
keyword: #p
keyword: freq=noraman
keyword: PBEPBE/SDD
title: #p freq=noraman PBEPBE/SDD
converged: YES YES NO NO
title: Mulliken charges:
elementType: Cl O O N N C C C C C C C C C C C C H H H H H H H H H
charge: -0.054150 -0.225430 -0.222867 -0.509648 0.019046 0.486620 0.491373 -0.418968 -0.350767 0.385520 -0.346040 -0.370198 -0.345729 -0.455441 -0.083093 -0.173935 -0.262902 0.310852 0.235026 0.277554 0.287343 0.287306 0.298544 0.239591 0.237461 0.262933
chargesum: 0.00000
title: Mulliken charges with hydrogens summed into heavy atoms:
elementType: Cl O O N N C C C C C C C C C C C C
charge: -0.054150 -0.225430 -0.222867 -0.198795 0.019046 0.486620 0.491373 -0.183942 -0.073213 0.385520 -0.058697 -0.082892 -0.047185 -0.215850 -0.083093 0.063525 0.000031
polarizability: 3.32085508e+02 -1.91827644e+01 1.73237244e+02 1.40107042e+01 8.69905936e+00 7.74802506e+01
1716.lowfreq: -8.5003 -3.5683 0.0016 0.0018 0.0023 4.2361 33.8046 37.5476 54.6930
frequency: 33.8009 37.4726 54.6890 84.6291 109.9663 171.9028 184.3211 228.3416 233.6891 276.1172 299.8732 356.7420 390.6245 418.5565 430.0342 438.9458 485.0501 506.5235 528.7421 569.1401 596.4797 626.8061 653.3674 664.7216 670.7856 689.0828 729.0812 770.2875 781.4453 821.1002 833.2280 845.5227 882.1875 894.8963 903.5265 968.8669 978.7210 979.9097 991.4747 994.2474 1072.3247 1093.7994 1099.0947 1120.2659 1177.8262 1181.5420 1227.4927 1228.8863 1268.8076 1294.3011 1311.1213 1350.7105 1375.0606 1390.6406 1427.0504 1449.1800 1468.7468 1489.3417 1517.8684 1581.7714 1595.8261 1603.6156 1622.8003 3128.1169 3132.2154 3157.1031 3168.8262 3182.1160 3183.3132 3184.5021 3189.2715 3532.7404
redmass: 8.1205 5.9925 10.1864 5.4606 7.6705 8.2445 5.2758 5.6308 7.2518 5.6977 5.4017 4.7080 8.9105 3.0258 6.3172 3.0418 2.4836 6.4136 2.1001 2.6916 6.3437 7.0966 5.8746 4.3318 6.0840 2.7533 4.9520 4.0210 1.7899 1.7135 2.4566 1.8141 1.4445 1.4603 3.9226 1.3519 1.8090 2.5979 1.4588 2.5070 2.0794 1.6150 2.8532 1.2882 1.1217 1.4137 2.9037 4.2948 1.3993 1.4115 1.6843 6.3540 4.0183 7.4794 4.2010 3.7606 2.5022 2.2735 2.6982 6.8569 3.8673 6.7275 6.5568 1.0907 1.0887 1.0933 1.0886 1.0941 1.0950 1.0960 1.0958 1.0755
irintensity: 0.4653 0.7050 0.5993 0.4730 1.3624 2.9626 0.4580 3.2791 1.4733 4.2463 7.2172 6.5724 4.1620 1.8841 0.9843 18.8274 55.6172 7.2523 60.3737 24.7979 3.7646 1.0024 7.7209 40.1630 18.5425 22.8415 9.9624 34.2970 51.2435 7.1796 6.8255 88.7224 2.9088 13.8785 41.5164 1.4350 2.8876 6.5520 2.2234 0.2936 20.5209 6.5194 23.4719 20.7650 55.4821 277.3158 49.5277 582.9774 1.9610 30.0123 32.1481 85.9774 125.4213 40.0974 12.8363 24.9645 97.7646 38.2245 302.7724 52.3478 15.8886 534.7740 136.1462 10.2440 9.0172 14.1396 2.6880 2.2802 3.1339 0.5468 3.4569 36.6539
temp: 298.150 k
press: 1.00000 atm
elementType: 17 8 8 7 7 6 6 6 6 6 6 6 6 6 6 6 6 1 1 1 1 1 1 1 1 1
symmnumber: 1
zpe: 489997.5 jmol-1
zpe.correction: 0.186630 hartree
zpe.thermalcorrener: 0.200867 hartree
zpe.thermalcorrenthalpy: 0.201811 hartree
zpe.thermalcorrgfe: 0.143509 hartree
zpe.sumelectzpe: -1181.424419 hartree
zpe.sumelectthermal: -1181.410182 hartree
zpe.sumelectthermalent: -1181.409238 hartree
zpe.sumelectthermalfe: -1181.467540 hartree
dipole: 6.3181 -5.3758 -0.0379
dipole: 8.2957
quadrupole: -137.4321 -96.6490 -107.0625
quadrupole: 1.9366 5.4861 1.3789
quadrupole: -23.7175 17.0655 6.6520 1.9366 5.4861 1.3789
hfenergy: -1181.6110495 hartree
pointgroup: C01 [X(C12H9Cl1N2O2)]
dipole: 2.6540126 -1.8995095 -0.0193694 debye
dipolederiv: -0.1756064 -0.0798355 0.0018942 -0.3001357 -0.7337018 0.1455352 0.0612128 0.1419537 -0.0992784 -1.2054956 -0.0863924 -0.1285377 -0.3515003 -0.4443141 -0.1325155 -0.2869803 -0.1171493 -0.3297803 -0.7115659 0.1664964 0.0453864 0.5842914 -0.7438205 -0.2253301 0.2465947 -0.240791 -0.3533493 -2.426833 -0.018897 -0.0275824 0.2114292 -0.2786708 0.0337874 -0.0866005 0.0103171 -0.3515799 2.5868375 -0.2993414 0.0482759 -0.5666439 0.9726697 0.3671545 -0.0194408 0.3742816 0.3873113 2.1016209 -0.2006759 -0.035467 -0.9166267 0.1511744 0.0380736 0.0397929 0.0556477 0.1699684 1.618172 0.2481706 0.0936563 0.827953 0.2618607 -0.0372115 0.3828868 -0.0320508 0.1333731 -0.9395554 0.0801031 0.0208749 -0.2739209 0.0598424 0.1204356 -0.1220636 0.130716 -0.1461854 -0.5211939 0.0736189 0.0543557 0.7666739 -0.1860161 0.0397461 0.2725827 0.0252705 -0.1333693 -1.4142988 0.2254061 0.0223347 0.4692119 -0.1562028 -0.0672157 0.035757 -0.0739666 -0.020071 0.4863383 -0.0932289 -0.012701 -0.4654389 0.1082557 0.0699123 -0.1632126 0.0949353 -0.0434195 0.7111958 -0.0948817 0.0120145 0.0457677 -0.0076433 0.0557958 0.1230081 0.0226397 -0.0577207 -0.3785132 -0.0651826 0.011928 -0.5130166 -0.3919245 0.0043349 0.0000948 0.0210563 -0.1243018 -0.5702803 -0.1041163 0.0119723 0.0708309 0.0128733 -0.0316431 -0.047091 -0.0654718 -0.1997615 0.3810513 0.0992496 0.0647898 0.5301423 1.1535365 -0.2569171 -0.0526476 -0.249873 0.024608 0.2463118 0.0994525 0.0300441 0.0162636 0.1785403 -0.0730106 0.141606 -0.0451693 -0.0887025 -0.2549981 0.0523348 0.0020429 -0.1155498 -0.4092986 0.0838919 0.01297 0.0890468 -0.1657812 0.0842169 -0.0087875 -0.0176183 -0.0297358 0.1591382 -0.0311149 -0.2367848 -0.0312295 0.2985612 0.0558604 0.0800187 0.0227926 0.0514531 -0.0275385 -0.0984428 0.0063836 -0.0937243 0.1101867 0.0284618 -0.043048 -0.0551967 -0.0665199 0.0596 -0.0493664 -0.0803487 -0.048251 0.1116133 0.0689744 -0.0566003 -0.0430001 -0.0013183 0.104345 -0.0361946 -0.0284402 -0.0329115 0.1459915 0.1032329 0.0280207 0.0142071 -0.0167783 0.0660536 -0.0586314 0.0186305 -0.0476688 0.137002 0.0633489 0.0459122 -0.0442128 0.0803727 0.0743166 0.0274966 -0.0796146 0.0218392 0.1360113 0.1012875 -0.0735858 -0.0087922 -0.0483406 -0.0755955 0.0529508 -0.0175904 0.0486416 0.1544307 -0.0392611 0.0750764 -0.0538318 0.0813629 0.0172472 0.0490488 -0.0708459 0.0424677 0.1334009 0.0006915 -0.0492866 -0.0296295 -0.070227 0.075273 0.0094302 -0.0498588 -0.0005563 0.1708424 unknown
polarizability: 334.2191068|-5.6438134|171.1528316|12.7762437|9.8381321|77.4310646 unknown
InChI: InChI=1S/C12H9ClN2O2/c13-9-2-1-3-11(8-9)14-10-4-6-12(7-5-10)15(16)17/h1-8,14H
charge 0 multiplicity 1
26 atoms
Cl 3.836721 2.936249 -0.497341
O  -5.411585 -0.205293 -0.393427
O  -4.693928 1.687994 0.667187
N  0.868858 -1.398446 -0.19132
N  -4.476473 0.540906 0.105291
C  -0.426285 -0.866784 -0.116716
C  2.120767 -0.75843 -0.003912
C  -1.498912 -1.638242 -0.663243
C  -0.726668 0.375587 0.520584
C  -3.091975 0.057058 0.030718
C  -2.821754 -1.185628 -0.590655
C  -2.05076 0.832521 0.591699
C  2.318619 0.619405 -0.293732
C  3.225377 -1.548334 0.42002
C  3.60125 1.166898 -0.122149
C  4.500674 -0.966753 0.562666
C  4.708142 0.408621 0.304389
H  0.920515 -2.395708 -0.409963
H  -1.279468 -2.593015 -1.156268
H  0.065858 0.958633 0.99494
H  -3.648921 -1.764051 -1.009996
H  -2.297845 1.775417 1.086755
H  1.508764 1.236637 -0.687936
H  3.077464 -2.609944 0.649652
H  5.343187 -1.58346 0.892075
H  5.691377 0.869362 0.427582
