program: Gaussian 09
title: 000288558
version: EM64L-G09RevD.01
frameworkgroup: C1[X(C16H10Cl2N2O2)]
method: RPBEPBE
basis: SDD
operation: Freq
keyword: #p
keyword: freq=noraman
keyword: PBEPBE/SDD
title: #p freq=noraman PBEPBE/SDD
converged: YES YES NO NO
title: Mulliken charges:
elementType: Cl Cl O O N N C C C C C C C C C C C C C C C C H H H H H H H H H H
charge: -0.061404 -0.048081 -0.230806 -0.192076 -0.330938 -0.419763 0.239658 0.031281 0.502784 0.180590 -0.432951 0.549479 -0.303880 -0.370652 -0.256894 -0.470532 -0.098754 -0.204392 -0.254372 -0.106298 -0.173707 -0.265254 0.273969 0.353109 0.305748 0.290040 0.251507 0.242039 0.235854 0.259495 0.240722 0.264478
chargesum: 0.00000
title: Mulliken charges with hydrogens summed into heavy atoms:
elementType: Cl Cl O O N N C C C C C C C C C C C C C C C C
charge: -0.061404 -0.048081 -0.230806 -0.192076 -0.330938 -0.066654 0.239658 0.031281 0.502784 0.180590 -0.158983 0.549479 0.001869 -0.080613 -0.005387 -0.228493 -0.098754 0.031462 0.005123 -0.106298 0.067015 -0.000776
polarizability: 3.91566481e+02 -2.73916579e+01 2.49301898e+02 -4.65274262e-01 -6.97135341e-01 8.33561609e+01
1716.lowfreq: -3.2946 -1.2049 -0.0016 0.0005 0.0011 5.3202 10.7026 21.9481 30.2586
frequency: 10.6085 21.9340 30.2553 50.6754 82.9407 91.4649 142.7498 166.0518 178.0085 179.6376 182.0809 226.6051 243.4394 261.7682 285.0803 314.4965 332.4545 367.9269 389.1202 407.0747 430.4876 435.7499 466.5820 481.5912 555.2369 569.2043 572.4768 586.0484 612.0032 652.4410 676.2050 676.7415 678.6713 679.1439 716.1605 744.3856 764.3971 766.1670 779.8517 787.2961 800.4735 849.0999 876.7500 880.9228 890.6604 901.4946 930.4363 972.7559 975.8114 979.3927 982.1539 998.2075 1066.7856 1074.0279 1082.8109 1102.0356 1112.1726 1178.4068 1183.2479 1187.4381 1222.0565 1227.3097 1283.6898 1299.1740 1305.6963 1356.3475 1375.7625 1388.7956 1429.5820 1432.5182 1472.4560 1474.6380 1535.5250 1572.9367 1588.2599 1606.5665 1609.2352 1627.2475 1665.6993 1681.2309 3132.9550 3149.9375 3159.9307 3177.8090 3184.2819 3200.6705 3206.8786 3226.0158 3256.7873 3400.5194
redmass: 10.9696 7.5925 6.5274 9.2691 6.5090 12.5197 9.0102 5.9370 6.5924 7.8293 5.1034 8.2048 9.4909 4.6574 5.8109 10.6975 5.2486 6.0616 11.8680 8.3066 2.9833 3.1047 9.4631 5.2011 6.0637 5.4687 5.2833 10.1515 7.1627 6.7211 4.4669 2.3631 2.3954 2.5847 7.2976 3.0973 2.0318 3.7248 1.8989 1.5648 1.2965 1.6793 5.4959 1.4831 1.4257 1.4013 5.7875 1.3395 1.3826 5.7404 5.7025 5.7997 2.5236 2.4322 2.0313 1.5618 1.8448 2.1544 1.4187 1.1127 3.1226 1.7838 1.8666 1.3431 1.5260 5.5166 9.0619 7.6425 2.9291 3.0104 2.4942 2.5452 2.2217 6.6746 4.4216 6.5119 6.5078 6.9543 9.8850 10.9349 1.0894 1.0887 1.0927 1.0961 1.0976 1.0928 1.0951 1.0921 1.0973 1.0749
irintensity: 0.6336 0.4993 0.4779 0.6087 1.8030 0.7671 2.6724 1.7795 0.1224 0.6367 0.3067 1.1873 0.5187 1.7439 0.2505 17.8647 2.3322 6.9893 5.2105 6.6104 10.7655 2.3722 6.5861 2.5218 1.2110 0.7524 0.7522 85.0483 8.2427 19.9280 23.1943 1.8944 7.0739 44.4118 6.7146 6.5517 16.3774 32.9653 4.8700 93.7262 105.4933 48.9496 61.8854 27.1203 7.5985 2.7731 26.2931 1.9703 1.1600 13.4679 20.8755 75.7847 100.7188 21.0331 24.4098 2.6397 12.5650 121.6515 44.8619 1.4079 50.9033 4.4311 23.5465 42.5427 2.0778 391.4631 12.0362 8.0905 76.0765 27.6114 130.0770 139.4977 276.8814 30.7950 139.6802 231.0415 118.9783 439.7819 536.7173 31.3721 6.3417 9.8167 10.6586 4.7552 3.2306 3.6192 2.8886 0.7332 4.9993 63.9178
temp: 298.150 k
press: 1.00000 atm
elementType: 17 17 8 8 7 7 6 6 6 6 6 6 6 6 6 6 6 6 6 6 6 6 1 1 1 1 1 1 1 1 1 1
symmnumber: 1
zpe: 585397.4 jmol-1
zpe.correction: 0.222966 hartree
zpe.thermalcorrener: 0.241581 hartree
zpe.thermalcorrenthalpy: 0.242525 hartree
zpe.thermalcorrgfe: 0.172589 hartree
zpe.sumelectzpe: -1794.282454 hartree
zpe.sumelectthermal: -1794.263839 hartree
zpe.sumelectthermalent: -1794.262895 hartree
zpe.sumelectthermalfe: -1794.332831 hartree
dipole: 3.3042 -1.9385 0.8977
dipole: 3.9346
quadrupole: -134.3921 -141.0672 -144.9993
quadrupole: -22.9067 -1.9858 2.9058
quadrupole: 5.7607 -0.9143 -4.8464 -22.9067 -1.9858 2.9058
hfenergy: -1794.5054206 hartree
pointgroup: C01 [X(C16H10Cl2N2O2)]
dipole: 1.3891631 0.5035394 -0.4615066 debye
polarizability: 396.3281213|5.6723978|239.9572002|-5.2055156|-26.6337653|87.9392181 unknown
InChI: InChI=1S/C16H10Cl2N2O2/c17-10-3-1-5-12(7-10)19-14-9-15(21)20(16(14)22)13-6-2-4-11(18)8-13/h1-9,19H
charge 0 multiplicity 1
32 atoms
Cl -5.601697 2.867762 0.087284
Cl 5.969332 -2.389102 0.558083
O  -0.715978 1.739403 -0.678388
O  -1.393378 -2.715595 0.77456
N  -1.522416 -0.42751 -0.003562
N  1.846949 0.747855 -0.355814
C  0.804259 -0.093673 -0.088857
C  -0.561871 0.544455 -0.30024
C  -2.947173 -0.256754 -0.069581
C  -0.815914 -1.663486 0.416031
C  0.624808 -1.394505 0.334671
C  3.243183 0.549223 -0.292122
C  -3.501435 1.047265 0.032917
C  -3.796848 -1.380853 -0.239977
C  3.828748 -0.693723 0.066332
C  4.078327 1.657035 -0.609099
C  -4.896623 1.18839 -0.037926
C  -5.193229 -1.193079 -0.295045
C  -5.767379 0.094694 -0.197315
C  5.230985 -0.7887 0.098219
C  5.477829 1.521612 -0.565432
C  6.079497 0.290955 -0.208616
H  1.337713 -2.168349 0.600016
H  1.525626 1.682463 -0.653064
H  -2.860505 1.922713 0.144542
H  -3.374396 -2.383751 -0.307504
H  3.22618 -1.56723 0.308921
H  3.627993 2.617249 -0.886256
H  -5.846029 -2.062845 -0.42129
H  -6.849672 0.241093 -0.246314
H  6.113243 2.378617 -0.809821
H  7.165973 0.178969 -0.171948
