program: Gaussian 09
title: 000288551
version: EM64L-G09RevD.01
frameworkgroup: C1[X(C14H12ClNO2S)]
method: RPBEPBE
basis: SDD
operation: Freq
keyword: #p
keyword: freq=noraman
keyword: PBEPBE/SDD
title: #p freq=noraman PBEPBE/SDD
converged: YES YES NO NO
title: Mulliken charges:
elementType: Cl S O O N C C C C C C C C C C C C C C H H H H H H H H H H H H
charge: -0.068466 0.172021 -0.444058 -0.283494 -0.455817 -0.595872 0.456057 0.640247 -0.392367 0.002686 -0.431123 -0.383269 -0.269625 0.213337 -0.220771 -0.046714 -0.258751 -0.337967 -0.502431 0.317624 0.310373 0.253907 0.260169 0.245833 0.231860 0.257383 0.257230 0.373146 0.214771 0.254943 0.229137
chargesum: 0.00000
title: Mulliken charges with hydrogens summed into heavy atoms:
elementType: Cl S O O N C C C C C C C C C C C C C C
charge: -0.068466 0.172021 -0.070912 -0.283494 -0.145443 -0.278248 0.456057 0.640247 -0.392367 0.002686 -0.177216 -0.123100 -0.023792 0.213337 0.011090 -0.046714 -0.001368 -0.080736 0.196420
polarizability: 3.24436073e+02 -5.32734271e-01 1.85469559e+02 -6.50551310e-01 -3.47319355e+00 1.00557853e+02
1716.lowfreq: -4.8780 -0.0030 -0.0029 -0.0012 2.7044 4.1664 25.8127 34.3988 52.3478
frequency: 25.7532 34.3644 52.3370 63.2732 108.2596 118.3772 146.4692 159.3346 177.5963 216.9066 240.3380 251.2055 275.3433 277.0997 301.7072 320.5310 333.1430 364.7843 402.8371 424.6846 431.2366 451.3539 495.1596 513.2989 537.0942 540.8084 547.9341 574.3827 591.4720 621.1499 686.7874 696.2970 712.5898 730.8316 739.8340 792.5229 798.1307 811.5903 844.8056 885.1441 899.1368 903.8406 924.7493 966.9858 994.7861 1026.0672 1066.3038 1068.2898 1110.6914 1112.4778 1130.3875 1151.1688 1156.7389 1173.6430 1196.6688 1228.9084 1240.5510 1267.9924 1270.5445 1279.8106 1336.8131 1356.6096 1387.5647 1403.9025 1433.7642 1445.9133 1453.3081 1454.5680 1466.6203 1470.1973 1474.7869 1582.3750 1595.2252 1601.1581 1606.9552 2935.3724 2989.2356 3098.7923 3131.1845 3141.9703 3155.7530 3158.7430 3163.4341 3175.7308 3184.6031 3446.3321 3578.9794
redmass: 6.7640 4.2569 3.6275 5.6863 6.0251 4.0286 4.7396 2.2585 4.0822 3.8931 5.2704 4.8881 3.5610 4.3180 6.1803 16.4472 2.1320 2.6221 4.9151 2.6439 2.3906 1.7326 5.5560 6.4394 4.8720 6.2256 5.0722 4.9840 6.0013 5.4819 5.7403 6.7437 3.9489 5.7465 2.3385 1.3173 2.0114 4.9516 1.5601 4.8223 5.3207 1.4166 1.3468 1.3146 5.0114 6.5007 2.0309 2.0870 1.2437 2.8910 1.3834 1.3688 1.6228 1.3605 1.3588 2.2188 1.3320 1.8153 2.0038 2.1671 1.7009 1.8432 6.5210 3.9561 1.2407 3.1391 2.0715 1.1475 1.6176 1.7018 2.5594 6.5375 6.9150 7.2105 7.0525 1.0850 1.0324 1.0996 1.1057 1.0863 1.0900 1.0925 1.0929 1.0987 1.0960 1.0674 1.0779
irintensity: 0.1466 3.3229 3.8543 2.1650 0.2717 0.9861 5.3240 0.3435 3.9558 1.3873 0.7436 8.9685 48.1742 4.1508 7.2148 1.0305 26.0602 36.3727 11.7158 8.8962 68.1909 54.3501 7.9637 11.8184 7.8310 3.1936 12.0528 10.3267 6.0146 0.9562 10.0666 3.5913 0.5548 10.9081 38.6196 45.0040 28.7283 35.3344 43.7356 63.1354 5.2399 5.2435 0.2612 1.7366 43.6068 71.3030 43.7035 23.2507 2.4910 38.4064 22.0888 4.6308 49.9689 4.6042 16.0198 255.0910 2.7055 108.7997 31.8679 14.4719 12.5062 222.9514 21.6011 20.5028 0.9343 86.5208 25.5748 9.4356 147.2575 33.4801 57.8948 36.9645 15.4103 124.5397 14.6615 31.8463 69.3127 42.1959 21.8231 3.7622 3.4301 8.0113 1.3968 13.0750 1.7908 140.8204 34.3855
temp: 298.150 k
press: 1.00000 atm
elementType: 17 16 8 8 7 6 6 6 6 6 6 6 6 6 6 6 6 6 6 1 1 1 1 1 1 1 1 1 1 1 1
symmnumber: 1
zpe: 596316.9 jmol-1
zpe.correction: 0.227125 hartree
zpe.thermalcorrener: 0.244775 hartree
zpe.thermalcorrenthalpy: 0.245720 hartree
zpe.thermalcorrgfe: 0.180308 hartree
zpe.sumelectzpe: -1602.629380 hartree
zpe.sumelectthermal: -1602.611730 hartree
zpe.sumelectthermalent: -1602.610786 hartree
zpe.sumelectthermalfe: -1602.676198 hartree
dipole: -1.2360 -0.2579 -0.0838
dipole: 1.2654
quadrupole: -139.1177 -110.6029 -129.0976
quadrupole: 0.8659 -2.7531 -1.9469
quadrupole: -12.8450 15.6699 -2.8249 0.8659 -2.7531 -1.9469
hfenergy: -1602.8565054 hartree
pointgroup: C01 [X(C14H12Cl1N1O2S1)]
dipole: -0.4886076 0.0950394 -0.0085929 debye
polarizability: 323.2490904|3.8207687|184.3650967|15.7705323|-10.2490794|102.8492979 unknown
InChI: InChI=1S/C14H12ClNO2S/c1-18-11-4-2-3-9(13(11)17)14-16-10-7-8(15)5-6-12(10)19-14/h2-7,14,16-17H,1H3
charge 0 multiplicity 1
31 atoms
Cl 6.340119 -0.597619 0.843328
S  0.49428 1.419291 -0.916903
O  -2.533635 1.464015 0.543653
O  -5.092793 0.15553 -0.047663
N  1.070859 -0.859082 0.41384
C  -0.095267 0.014362 0.33742
C  -1.385247 -0.630364 -0.086324
C  2.307086 -0.21978 0.251416
C  2.222187 1.041248 -0.412839
C  -2.577896 0.133445 0.067956
C  -1.450486 -1.956997 -0.570697
C  3.567073 -0.724977 0.642071
C  3.370057 1.78958 -0.701473
C  -3.844877 -0.452159 -0.215205
C  -2.705643 -2.541862 -0.843435
C  4.707925 0.048207 0.338683
C  4.64445 1.289117 -0.318754
C  -3.887516 -1.797415 -0.658334
C  -5.251975 1.611802 -0.239531
H  -0.237564 0.578052 1.283739
H  0.988624 -1.751685 0.899202
H  -0.523981 -2.514566 -0.738804
H  3.661386 -1.68094 1.164881
H  3.299232 2.750785 -1.219347
H  -2.765598 -3.571529 -1.209802
H  5.553345 1.857189 -0.530265
H  -4.872406 -2.225218 -0.868679
H  -1.67086 1.906546 0.318229
H  -4.809157 1.932108 -1.200642
H  -4.789164 2.175667 0.584441
H  -6.342159 1.764249 -0.257562
