program: Gaussian 09
title: 000288534
version: EM64L-G09RevD.01
frameworkgroup: C1[X(C13H13NO5)]
method: RPBEPBE
basis: SDD
operation: Freq
keyword: #p
keyword: freq=noraman
keyword: PBEPBE/SDD
title: #p freq=noraman PBEPBE/SDD
converged: NO YES NO NO
title: Mulliken charges:
elementType: O O O O O N C C C C C C C C C C C C C H H H H H H H H H H H H H
charge: -0.234195 -0.252829 -0.251221 -0.197762 -0.201186 -0.179162 -0.363046 -0.432069 0.464686 -0.316906 -0.301921 -0.050957 -0.476513 0.309567 0.081778 0.112877 -0.419757 0.339860 -0.769010 0.259698 0.234895 0.238312 0.256915 0.193857 0.232517 0.229148 0.205632 0.245819 0.278366 0.250919 0.248467 0.263225
chargesum: 0.00000
title: Mulliken charges with hydrogens summed into heavy atoms:
elementType: O O O O O N C C C C C C C C C C C C C
charge: -0.234195 -0.252829 -0.251221 -0.197762 -0.201186 -0.179162 0.131547 0.063157 0.464686 0.109468 0.132858 -0.050957 -0.230694 0.309567 0.081778 0.112877 -0.141392 0.339860 -0.006400
polarizability: 2.30648907e+02 1.75236389e-01 2.04987273e+02 -1.42420201e+01 4.75987761e+00 9.75787495e+01
1716.lowfreq: -126.9564 -17.1829 -7.1008 0.0007 0.0008 0.0009 6.1852 37.9699 39.9543
frequency: -126.9553 37.2379 39.5294 78.6200 86.7692 140.7997 154.9605 179.9539 182.0088 213.8852 239.5781 256.9523 286.3889 314.4170 324.0743 347.4188 390.0165 412.6892 448.6708 453.4754 491.3002 518.0455 539.1314 551.8459 564.9982 601.0697 635.3220 639.8528 651.5041 660.9071 692.8476 713.8119 757.8317 793.6522 805.0367 822.1773 828.9094 845.7170 851.6210 900.0613 944.1852 990.9848 1002.9330 1011.9180 1038.4255 1049.2354 1064.6723 1077.7000 1108.8375 1119.2699 1163.0799 1163.9729 1189.1031 1199.7548 1236.2026 1252.8813 1271.4764 1298.9356 1325.6113 1332.6082 1344.6250 1354.0175 1370.6244 1374.8941 1397.2658 1436.1062 1446.4076 1449.6404 1454.9024 1458.7098 1461.6428 1468.8496 1506.0507 1561.3325 1620.5935 1683.9580 1726.0317 2946.1581 2955.0819 2996.2553 2998.0191 3031.4805 3080.9492 3083.0231 3087.8610 3090.9644 3123.0580 3123.9458 3190.4698 3199.2142
redmass: 1.0263 5.6398 4.9557 4.4520 4.6421 5.7729 6.4396 6.0525 3.0151 5.7216 3.4563 4.1025 4.1131 4.7128 4.9877 3.2552 3.7712 7.5920 2.5329 4.6611 5.5746 5.2891 7.2580 4.0847 3.3683 2.3927 3.8729 7.9086 7.4010 7.8708 6.2994 6.7260 5.9487 4.2211 1.6562 4.1752 2.0078 1.4453 3.6778 2.5863 5.6445 2.6370 1.7660 2.1785 1.5139 2.2497 3.7489 2.9088 4.6363 3.1223 3.8228 2.6754 1.1150 2.2099 1.3169 1.2955 1.1973 2.9895 1.2382 1.2219 1.3122 1.7540 1.5264 3.8118 1.2719 1.2055 1.0847 1.9409 1.1945 1.1705 1.0468 1.3075 6.5547 7.1893 7.6315 12.0266 11.2723 1.0679 1.0680 1.0659 1.0377 1.0644 1.0978 1.0954 1.0979 1.0970 1.1004 1.0991 1.0893 1.0940
irintensity: 0.1349 4.5147 0.1825 0.2696 0.2157 6.1507 2.2245 1.2047 4.1238 0.7346 7.1949 4.6062 2.4291 7.6561 4.2133 1.9066 7.8931 8.3609 0.5633 0.2763 11.3238 5.9862 0.9278 6.0497 19.8247 6.9641 2.0364 5.0834 2.1846 4.6149 20.1461 92.2707 3.2244 16.4248 41.3257 58.3490 15.7823 35.0064 60.2654 2.3639 63.4147 8.5964 1.8573 30.7981 8.7315 45.2601 32.0119 2.9491 44.7279 37.8368 13.4826 24.6178 12.1130 7.9392 66.1613 23.6729 18.0971 34.9270 11.8574 6.6051 7.0432 16.8765 35.7786 14.0787 21.6392 58.8688 4.6075 54.2180 3.1879 27.7427 19.1531 24.4561 165.1548 281.0556 220.1621 492.4506 793.0726 43.2801 45.8251 34.2757 4.5483 17.6394 7.0442 32.7597 38.5167 8.6504 12.9032 3.9850 3.0971 2.2733
temp: 298.150 k
press: 1.00000 atm
elementType: 8 8 8 8 8 7 6 6 6 6 6 6 6 6 6 6 6 6 6 1 1 1 1 1 1 1 1 1 1 1 1 1
symmnumber: 1
zpe: 635916.9 jmol-1
zpe.correction: 0.242208 hartree
zpe.thermalcorrener: 0.258102 hartree
zpe.thermalcorrenthalpy: 0.259046 hartree
zpe.thermalcorrgfe: 0.198564 hartree
zpe.sumelectzpe: -932.640460 hartree
zpe.sumelectthermal: -932.624566 hartree
zpe.sumelectthermalent: -932.623622 hartree
zpe.sumelectthermalfe: -932.684105 hartree
dipole: -1.3770 -2.6381 1.1028
dipole: 3.1737
quadrupole: -89.2836 -139.4147 -108.9821
quadrupole: 8.7812 -7.1038 -7.1833
quadrupole: 23.2765 -26.8545 3.5780 8.7812 -7.1038 -7.1833
hfenergy: -932.8826682 hartree
pointgroup: C01 [X(C13H13N1O5)]
dipole: 0.4165839 0.8802684 0.7814256 debye
polarizability: 229.4547734|-3.2191325|195.5120385|18.1062925|31.0068611|108.2481178 unknown
InChI: InChI=1S/C13H13NO5/c1-8-6-10-12(13(16)18-8)9(7-11(15)19-10)14-2-4-17-5-3-14/h6-7H,2-5H2,1H3
charge 0 multiplicity 1
32 atoms
O  -4.430512 0.4713 0.609543
O  1.735884 -1.982227 -0.468527
O  2.314213 2.028163 0.382709
O  0.218858 2.624864 -0.346728
O  0.550602 -3.753857 -1.404141
N  -1.760637 0.42621 -0.522554
C  -2.086197 1.360134 0.585499
C  -2.959279 0.104763 -1.33301
C  -0.605316 -0.338072 -0.57862
C  -3.243179 0.767791 1.426626
C  -4.086121 -0.482521 -0.458359
C  0.703542 0.22215 -0.194478
C  -0.647645 -1.668865 -1.040608
C  1.814928 -0.657983 -0.13312
C  0.957777 1.655503 -0.092169
C  0.465361 -2.56413 -1.056197
C  3.122423 -0.223064 0.259139
C  3.337642 1.109563 0.53511
C  4.631136 1.733881 0.980513
H  -2.369124 2.341186 0.165459
H  -1.213173 1.51241 1.235886
H  -2.692965 -0.565133 -2.165805
H  -3.319499 1.058291 -1.766562
H  -2.900845 -0.157641 1.939973
H  -3.580508 1.500827 2.177944
H  -5.011332 -0.622622 -1.040528
H  -3.775396 -1.453492 -0.01588
H  -1.5936 -2.131349 -1.327398
H  3.928369 -0.955036 0.323741
H  5.422389 1.578434 0.225382
H  4.981113 1.285616 1.927161
H  4.494891 2.81621 1.1280
