program: Gaussian 09
title: 000288509
version: EM64L-G09RevD.01
frameworkgroup: C1[X(C10H7BrS)]
method: RPBEPBE
basis: SDD
operation: Freq
keyword: #p
keyword: freq=noraman
keyword: PBEPBE/SDD
title: #p freq=noraman PBEPBE/SDD
converged: NO YES NO NO
title: Mulliken charges:
elementType: Br S C C C C C C C C C C H H H H H H H
charge: 0.027340 0.304426 0.295741 0.503283 -0.364937 -0.364945 -0.199759 -0.732629 -0.215600 -0.215600 -0.546751 -0.235715 0.243154 0.243153 0.288524 0.228852 0.228852 0.282168 0.230441
chargesum: 0.00000
title: Mulliken charges with hydrogens summed into heavy atoms:
elementType: Br S C C C C C C C C C C
charge: 0.027340 0.304426 0.295741 0.503283 -0.121784 -0.121792 -0.199759 -0.444105 0.013253 0.013252 -0.264583 -0.005273
polarizability: 1.70682795e+02 -1.84196334e+01 1.24481861e+02 2.10749944e-03 -1.01761464e-02 9.36075795e+01
1716.lowfreq: -40.0439 -10.8349 -6.8114 0.0013 0.0019 0.0024 1.1600 56.5339 86.4435
frequency: -40.0366 56.5316 86.4234 164.0527 172.9712 244.1791 329.0008 343.1678 352.5981 400.2373 464.7478 533.8009 608.5878 610.1784 666.5156 683.4065 703.4228 714.1060 751.8699 784.8234 789.7660 808.7202 853.1580 906.4570 922.5684 975.2064 988.4953 996.4025 1024.2094 1066.4193 1077.7723 1157.1514 1172.7042 1187.3054 1221.2483 1310.9070 1342.9990 1370.4062 1429.0641 1440.1249 1477.7360 1542.0955 1584.7234 1615.1676 3124.6331 3131.5496 3142.8584 3152.2337 3165.9972 3231.0366 3249.8167
redmass: 4.1292 8.4545 4.9834 6.7313 6.2500 9.1989 12.1351 6.3554 5.3537 2.8316 4.3241 3.7128 7.8999 6.1354 1.8295 6.6486 1.8292 2.4355 2.3682 3.6833 1.2716 4.7022 1.2429 6.3157 1.4064 1.3843 6.0238 1.3232 2.4706 1.8990 1.6001 1.2269 1.0533 1.1147 1.8495 1.3604 5.0021 7.1017 2.2012 5.1360 2.8786 7.5720 6.0382 6.3650 1.0846 1.0879 1.0927 1.0970 1.1018 1.0960 1.0974
irintensity: 0.0004 0.4443 0.4617 1.0515 0.2310 0.0868 0.8534 1.8904 0.4071 0.0300 4.9971 11.4949 15.0200 0.0513 0.1463 12.4890 43.8704 4.9721 30.9596 23.3038 84.3252 20.3714 0.1239 38.4276 1.5239 0.0376 1.1603 0.0568 10.1058 7.5438 8.2018 0.5630 0.0103 0.7558 4.5731 0.3373 28.9676 0.0220 8.0489 0.7383 10.7507 5.0490 1.3613 4.1094 0.8797 0.5323 19.5290 35.5631 18.9921 0.8788 2.5763
temp: 298.150 k
press: 1.00000 atm
elementType: 35 16 6 6 6 6 6 6 6 6 6 6 1 1 1 1 1 1 1
symmnumber: 1
zpe: 353673.3 jmol-1
zpe.correction: 0.134707 hartree
zpe.thermalcorrener: 0.144323 hartree
zpe.thermalcorrenthalpy: 0.145267 hartree
zpe.thermalcorrgfe: 0.097838 hartree
zpe.sumelectzpe: -795.933365 hartree
zpe.sumelectthermal: -795.923749 hartree
zpe.sumelectthermalent: -795.922805 hartree
zpe.sumelectthermalfe: -795.970234 hartree
dipole: -0.7072 -1.0625 0.0000
dipole: 1.2764
quadrupole: -75.8985 -86.5523 -83.3077
quadrupole: 0.1822 -0.0003 0.0011
quadrupole: 6.0210 -4.6328 -1.3882 0.1822 -0.0003 0.0011
hfenergy: -796.0680722 hartree
pointgroup: C01 [X(C10H7Br1S1)]
dipole: -0.2568526 0.4315024 -0.0000106 debye
dipolederiv: -0.0800946 -0.1314591 0.0000184 -0.1626255 -0.5258962 0.0001021 0.0000358 0.0001175 0.0072266 -0.3535802 -0.1717526 0.0000079 -0.2030759 -0.2367332 0.000104 -0.000129 -0.0000891 0.143895 0.2961507 -0.0255934 -0.000024 -0.0293457 -0.0478043 0.0000149 0.0000475 0.0001236 0.0360691 0.2186761 -0.174582 -0.0000168 -0.1274282 -0.2167174 -0.0000639 -0.0000348 -0.0000549 -0.035931 -0.137968 0.0032131 -0.0836905 -0.0018369 -0.114226 0.0110737 0.0042491 0.004987 0.0542068 -0.1379645 0.003272 0.0836725 -0.0018825 -0.1142635 -0.0110487 -0.0043194 -0.0051139 0.054231 -0.1130116 0.138264 -0.0000364 0.1324398 0.9223012 -0.0001078 -0.0000258 -0.0001873 -0.0980928 0.3322735 0.1667098 0.0000974 0.1141956 -0.1226036 -0.0000343 0.0001057 0.0001092 -0.2843854 -0.0372412 0.0116091 0.0919333 0.0261428 -0.1425321 0.0078928 0.073772 0.0020008 0.0762837 -0.0372344 0.011573 -0.0918911 0.0261517 -0.1424481 -0.0078305 -0.073917 -0.0024005 0.0762891 -0.1429954 0.1464791 -0.0000554 0.233741 0.093941 -0.000006 0.000046 -0.0000181 -0.2679373 0.0999157 0.0308025 -0.0000062 0.0258244 -0.155411 0.0000131 0.0000167 0.0000716 -0.0546534 0.0532033 -0.0104227 0.0945529 -0.01615 0.1326655 0.0057906 0.0886945 0.0017499 -0.0345464 0.0532289 -0.010393 -0.0945589 -0.0161748 0.1326546 -0.005834 -0.0886548 -0.0016897 -0.0345587 0.0543131 0.0407189 -0.0000081 0.0299465 0.0348054 0.0000138 -0.000015 -0.0000181 0.195871 0.007312 -0.0096482 -0.0859392 -0.0152556 0.151614 -0.0076386 -0.1042156 -0.0064261 -0.0698948 0.0072567 -0.0097822 0.085937 -0.015236 0.151581 0.0075783 0.1043383 0.0067603 -0.0698712 0.0573308 0.0143219 0.0000269 0.0296522 0.0420314 -0.0000082 0.0000113 0.0001023 0.2178546 -0.1395709 -0.0233303 -0.0000198 -0.0290829 0.1570411 -0.0000113 -0.0000055 -0.0000246 0.0879443 unknown
polarizability: 172.4175933|16.0038771|122.7470626|-0.002617|-0.0100572|93.6075795 unknown
InChI: InChI=1S/C10H7BrS/c11-10-7-12-6-9(10)8-4-2-1-3-5-8/h1-7H
charge 0 multiplicity 1
19 atoms
Br 1.282421 -2.611614 0.00015
S  3.34932 1.397179 0.000144
C  -0.590135 0.221122 -0.000002
C  0.898671 0.353399 0.000012
C  -1.306269 0.155862 -1.223103
C  -1.306325 0.156194 1.223084
C  1.845059 -0.751509 0.000086
C  1.56259 1.571383 -0.000133
C  -2.713737 0.031164 -1.222798
C  -2.713793 0.031499 1.222749
C  3.177798 -0.388217 0.000005
C  -3.421331 -0.031597 -0.000032
H  -0.757363 0.202009 -2.170425
H  -0.757462 0.202597 2.170418
H  1.124011 2.567878 -0.000249
H  -3.255493 -0.017347 -2.174027
H  -3.255593 -0.016753 2.173967
H  4.060541 -1.02249 0.000001
H  -4.512809 -0.129359 -0.000044
