program: Gaussian 09
title: 000288505
version: EM64L-G09RevD.01
frameworkgroup: C1[X(C12H10OS)]
method: RPBEPBE
basis: SDD
operation: Freq
keyword: #p
keyword: freq=noraman
keyword: PBEPBE/SDD
title: #p freq=noraman PBEPBE/SDD
converged: NO YES NO NO
title: Mulliken charges:
elementType: S O C C C C C C C C C C C C H H H H H H H H H H
charge: 0.657155 -0.619664 0.327717 0.327719 -0.780375 -0.780376 -0.596401 -0.596401 0.389758 0.389758 -0.417376 -0.417376 -0.238165 -0.238166 0.308321 0.263737 0.263737 0.308321 0.250097 0.250097 0.242245 0.242244 0.231699 0.231699
chargesum: 0.00000
title: Mulliken charges with hydrogens summed into heavy atoms:
elementType: S O C C C C C C C C C C C C
charge: 0.657155 -0.619664 0.327717 0.327719 -0.208317 -0.208319 -0.346305 -0.346304 0.389758 0.389758 -0.175131 -0.175132 -0.006467 -0.006468
polarizability: 2.69553335e+02 4.47050178e-05 1.46037948e+02 -8.17584903e+00 -5.33001559e-06 6.93339681e+01
1716.lowfreq: -8.2648 -5.6505 -5.4280 0.0011 0.0019 0.0020 47.6874 112.7475 134.2438
frequency: 47.5905 112.7474 134.2396 155.8310 248.4492 251.3083 272.8483 302.0451 313.8885 394.4017 398.4612 478.1051 481.1038 485.5479 528.4849 585.6337 604.3265 621.0434 654.8460 726.3956 745.5394 760.6625 785.6102 808.5981 819.8390 849.9456 867.6676 874.8421 898.5762 920.6763 924.5330 968.7653 993.5054 1024.0599 1077.3020 1092.5254 1092.6583 1153.6224 1167.5960 1172.7075 1177.5888 1197.5308 1243.5888 1262.8697 1271.0307 1330.7588 1406.6950 1418.9482 1425.2460 1438.5788 1448.0895 1467.7870 1503.2456 1582.1362 1610.9413 1642.5220 3017.4870 3017.6003 3120.1780 3121.2152 3121.9147 3125.5535 3126.1488 3129.0283 3144.7938 3164.1678
redmass: 7.3011 3.5080 4.3385 8.2252 9.6921 4.7143 3.2655 2.4278 6.8722 4.2868 2.9994 2.8811 7.7683 5.0815 3.3567 5.6135 5.0206 6.4132 3.5219 5.2005 5.3420 1.2456 2.6714 4.3792 6.5265 1.3625 1.3999 1.4929 5.3024 1.7061 1.5746 1.4119 1.3414 2.2769 1.5394 2.0325 1.1201 1.4895 1.4455 1.1041 1.1888 1.5128 1.4739 4.4502 2.1026 1.7887 3.2418 3.9474 1.1712 1.2164 2.5599 4.4422 3.5151 7.2453 6.2335 7.2963 1.0606 1.0603 1.1043 1.1053 1.0864 1.0921 1.0906 1.0908 1.0947 1.1004
irintensity: 3.0965 0.2870 8.6748 3.9753 3.6428 3.3118 5.2836 0.7370 10.3613 0.3739 5.0806 15.3471 4.1328 4.9721 0.0037 7.5227 1.0455 5.4375 0.2115 0.0041 1.6873 64.4730 0.0010 36.3276 59.0287 0.8061 0.4164 23.1569 0.0037 0.0922 36.9315 12.8942 0.0004 5.3688 0.0485 2.8572 16.9603 2.6757 0.0068 0.1857 2.9125 4.6859 1.4276 5.6839 6.5823 1.1299 0.5875 2.5896 13.7206 6.8629 0.0145 14.5216 20.2669 0.0599 3.1744 0.0133 11.3708 8.1946 4.6657 1.8724 1.2326 21.6911 0.1010 1.5417 29.9266 35.0293
temp: 298.150 k
press: 1.00000 atm
elementType: 16 8 6 6 6 6 6 6 6 6 6 6 6 6 1 1 1 1 1 1 1 1 1 1
symmnumber: 1
zpe: 480373.5 jmol-1
zpe.correction: 0.182965 hartree
zpe.thermalcorrener: 0.194298 hartree
zpe.thermalcorrenthalpy: 0.195242 hartree
zpe.thermalcorrgfe: 0.145508 hartree
zpe.sumelectzpe: -935.526016 hartree
zpe.sumelectthermal: -935.514683 hartree
zpe.sumelectthermalent: -935.513739 hartree
zpe.sumelectthermalfe: -935.563472 hartree
dipole: 5.3148 0.0000 -0.6935
dipole: 5.3598
quadrupole: -110.7498 -75.2763 -92.8941
quadrupole: 0.0000 2.9126 0.0000
quadrupole: -17.7764 17.6971 0.0793 0.0000 2.9126 0.0000
hfenergy: -935.7089807 hartree
pointgroup: C01 [X(C12H10O1S1)]
dipole: 2.1064865 -0.0000788 -0.0968226 debye
dipolederiv: 1.2019249 -0.0000869 0.2798227 -0.0000446 0.3917016 0.0000074 0.0486727 0.0000178 0.2808186 -0.9688243 0.0000781 -0.2926832 -0.0000372 -0.407255 0.0000048 0.345151 -0.0000238 -0.3612384 0.1332736 -0.0812461 -0.0091193 -0.3379663 -0.0788018 -0.0350686 -0.1488916 -0.0267395 -0.0772722 0.1333113 0.0812302 -0.009086 0.3379997 -0.0788629 0.0350688 -0.1487645 0.0267535 -0.0772496 -0.1304038 -0.0479691 0.0160219 -0.0294004 0.0535704 -0.0111004 -0.0179345 -0.0765378 0.0381315 -0.1303959 0.0479808 0.0160395 0.0294231 0.0535315 0.0111048 -0.0179168 0.0765449 0.0381629 -0.1357998 -0.0082801 -0.0179058 0.0146642 0.1454761 0.0000851 -0.0029767 0.006618 -0.1577257 -0.1357996 0.0083122 -0.0179029 -0.0146362 0.1454788 0.0000241 -0.0029834 -0.0065112 -0.1577282 0.1122566 -0.0050373 0.0033382 -0.0205864 -0.1279979 -0.0031827 0.0638805 0.00444 0.0480182 0.1122589 0.0050139 0.0033405 0.0205415 -0.1280002 0.00312 0.0638886 -0.0045082 0.0480177 -0.0840555 -0.0047002 -0.0021983 0.0902243 0.1281117 0.0050321 -0.0060424 0.0011396 -0.170453 -0.0840629 0.0047211 -0.0021972 -0.0902027 0.1281226 -0.0049261 -0.0060742 -0.0010335 -0.1704549 0.0092979 0.1127478 0.0058767 0.0910423 0.0228396 0.000874 -0.0025315 0.0036965 -0.1589054 0.0092777 -0.1127485 0.0058368 -0.0910401 0.0228595 -0.00081 -0.0025635 -0.0036316 -0.1589074 -0.106483 0.0102083 0.0231385 -0.0216451 0.0766434 0.0024899 0.0161 -0.0341038 -0.0080524 0.0281278 -0.0396466 0.0013594 0.0237317 -0.0662095 0.0581044 -0.0665678 0.0578998 0.0604297 0.028129 0.0396369 0.0013684 -0.0237162 -0.0661689 -0.0581504 -0.0665818 -0.0579397 0.0603877 -0.1064829 -0.0102003 0.0231352 0.0216561 0.0766315 -0.0024613 0.016111 0.0341327 -0.0080406 0.0716751 -0.0078782 -0.00285 0.0210692 -0.0810323 0.0032389 -0.0263114 0.0014159 0.1477625 0.071674 0.0078652 -0.0028477 -0.0210741 -0.0810289 -0.0033199 -0.0263195 -0.0014944 0.1477609 0.078048 0.0416868 -0.0023399 -0.0374823 -0.1032269 -0.001641 0.0002408 0.0015959 0.1565001 0.0780474 -0.0417028 -0.0023545 0.0374654 -0.103227 0.0015492 0.0002537 -0.001688 0.1565 -0.0925067 -0.0932152 -0.0089133 -0.0982382 0.0384323 -0.0032367 -0.0059364 -0.0031259 0.1617678 -0.0924879 0.0932302 -0.0088799 0.0982522 0.0384123 0.0031937 -0.0059021 0.0030827 0.1617702 unknown
polarizability: 269.5141176|-0.0072264|146.0379456|8.6426291|0.013286|69.3731879 unknown
InChI: InChI=1S/C12H10OS/c13-14-7-11-5-9-3-1-2-4-10(9)6-12(11)8-14/h1-6H,7-8H2
charge 0 multiplicity 1
24 atoms
S  -3.596912 0.000395 -1.069322
O  -5.049328 0.000313 -0.254144
C  -1.103931 0.723422 -0.09542
C  -1.103998 -0.723211 -0.095679
C  -2.47354 1.346767 -0.156375
C  -2.473664 -1.346407 -0.156861
C  0.100794 1.42338 -0.073193
C  0.100662 -1.42329 -0.073701
C  1.354146 0.725175 -0.024375
C  1.354078 -0.725219 -0.024633
C  2.60753 1.419769 0.012155
C  2.607397 -1.419943 0.011651
C  3.813854 0.715439 0.050027
C  3.813788 -0.715739 0.049772
H  -2.988459 1.438711 0.817106
H  -2.530899 2.288872 -0.720906
H  -2.531109 -2.288303 -0.721733
H  -2.988596 -1.438656 0.816585
H  0.105685 2.519919 -0.091107
H  0.105451 -2.519823 -0.092004
H  2.607005 2.51635 0.011239
H  2.60677 -2.516524 0.010347
H  4.766147 1.255881 0.080259
H  4.76603 -1.256281 0.079812
