program: Gaussian 09
title: 000288539
version: EM64L-G09RevD.01
frameworkgroup: C1[X(C15H18N2O7)]
method: RPBEPBE
basis: SDD
operation: Freq
keyword: #p
keyword: freq=noraman
keyword: PBEPBE/SDD
title: #p freq=noraman PBEPBE/SDD
converged: YES YES NO NO
title: Mulliken charges:
elementType: O O O O O O O N N C C C C C C C C C C C C C C C H H H H H H H H H H H H H H H H H H
charge: -0.255649 -0.230088 -0.278275 -0.232679 -0.261202 -0.194520 -0.274414 -0.478072 0.025030 0.347310 0.215322 -0.308933 -0.497282 0.366074 0.443655 -0.378090 -0.541587 0.121873 -0.253206 0.274230 -0.264186 -0.661479 -0.535062 -0.665762 0.359671 0.292800 0.309414 0.254923 0.276860 0.230180 0.248771 0.233476 0.222894 0.241359 0.230082 0.220997 0.224849 0.224089 0.253981 0.249571 0.227994 0.215077
chargesum: 0.00000
title: Mulliken charges with hydrogens summed into heavy atoms:
elementType: O O O O O O O N N C C C C C C C C C C C C C C C
charge: -0.255649 -0.230088 -0.278275 -0.232679 -0.261202 -0.194520 -0.274414 -0.118401 0.025030 0.347310 0.215322 -0.016134 -0.187867 0.366074 0.443655 -0.123166 -0.264727 0.121873 0.225745 0.274230 0.192184 0.030960 0.167857 0.026880
polarizability: 4.08081296e+02 -5.72354020e+00 2.27509770e+02 -1.62726103e+01 -2.18552636e+01 1.36344304e+02
1716.lowfreq: -8.4761 -0.0010 -0.0009 0.0003 3.3675 5.3628 11.8211 21.1420 28.4846
frequency: 11.0218 20.4998 28.4067 37.9404 45.0558 59.8756 69.2072 77.6033 84.4364 95.2802 102.8108 119.6841 153.9457 161.6238 176.8501 184.6911 193.0000 201.1118 219.2083 225.9911 232.3934 250.3538 266.9539 297.2358 308.1600 325.3062 367.4664 385.3831 389.9162 420.2049 423.8380 434.9030 485.8158 530.0623 547.9827 575.3487 603.4296 629.7987 662.4024 666.5669 674.2895 681.7790 710.8595 726.1924 751.5878 755.1890 802.5058 811.2152 816.2816 826.2171 831.4362 836.5456 850.9069 876.9016 885.8571 905.4216 960.6529 961.9475 1005.0265 1009.3203 1023.9829 1050.5807 1094.0873 1095.1239 1111.4631 1112.5988 1127.8407 1146.0173 1156.7867 1157.7838 1161.0130 1175.6231 1210.3650 1255.3062 1273.2518 1279.4653 1280.1902 1308.8265 1341.8617 1351.5895 1356.0920 1383.4523 1387.6611 1390.1927 1394.6672 1434.8955 1441.3082 1455.6540 1459.3603 1462.0943 1462.5880 1469.4341 1470.1597 1483.2666 1484.5580 1492.6410 1522.9948 1582.3431 1586.7487 1606.9539 1627.4617 1636.4694 2964.1559 2992.2616 2992.6620 3027.5779 3039.4973 3054.6422 3087.5839 3087.9445 3091.9771 3096.4899 3117.8733 3125.4098 3132.9986 3157.7486 3162.0590 3190.6631 3193.7484 3196.3075
redmass: 4.9280 3.7796 4.6812 3.5583 3.1944 3.1889 6.8223 3.9989 5.3704 4.6636 4.5675 5.4729 4.6230 5.1289 4.2879 4.4372 2.6555 1.7095 1.5069 2.6492 2.2777 2.4240 3.0108 4.3264 3.3381 4.0063 5.1730 7.7644 5.7423 5.0352 3.8557 4.3553 5.4620 5.2212 3.5620 4.9633 5.9884 5.5468 4.7633 7.5091 5.3027 4.4690 5.5991 7.0754 5.3919 2.6321 1.7682 1.4433 2.2057 1.5433 1.5517 2.9305 3.6279 1.9194 3.4052 1.4744 1.4554 2.8536 4.7538 2.8168 3.6056 2.9817 2.1736 2.1561 3.6496 1.2673 2.5360 1.6406 1.6938 1.8666 2.8774 2.0176 1.9531 4.7268 1.1206 1.5381 1.1700 2.3574 2.8487 1.3989 1.4852 2.8689 1.2585 1.2503 4.0482 1.8997 1.8992 1.1073 1.0913 1.0515 1.0455 1.0500 1.0965 1.0570 1.0523 2.7871 2.9037 3.6968 9.3261 3.9785 7.2916 6.7974 1.0331 1.0360 1.0360 1.0594 1.0595 1.1044 1.0974 1.0970 1.1034 1.1025 1.1057 1.1077 1.0995 1.0919 1.0894 1.0943 1.0900 1.0806
irintensity: 1.8784 0.7975 0.3581 0.9786 1.0805 1.4660 2.5980 0.4403 1.1038 4.6595 0.1968 1.5906 3.1423 0.6295 2.0777 1.8904 4.6249 2.0530 1.4966 3.8419 0.5367 1.2839 3.7414 11.1858 8.8195 32.9236 3.7004 2.4487 6.5560 3.3542 4.9988 4.7405 10.9443 5.8381 17.2113 8.6829 6.8275 19.0545 22.7953 6.9775 2.8166 9.3031 4.7526 19.5940 6.3273 6.4121 33.5486 5.3133 7.4527 35.9047 38.9336 2.2889 0.2072 68.3039 71.5686 29.8427 6.0321 46.2554 89.9557 73.3831 206.6159 16.7600 61.7333 90.6509 491.6308 5.0718 422.8155 57.3697 27.6531 77.2494 171.3355 64.9907 237.8243 24.8921 5.0075 321.1271 92.9189 122.6797 74.7652 22.2664 1.1800 20.6116 22.1795 27.9874 101.6788 59.3485 18.6363 26.8116 9.7647 9.0442 11.7391 15.5369 152.8254 14.0331 12.8672 478.9480 210.7721 97.4261 554.8208 214.5370 218.9320 5.9348 68.1056 28.8480 13.9433 43.2652 17.7069 43.6777 38.4765 43.5068 0.3463 4.3128 39.2182 23.6554 21.5713 7.1583 7.6495 8.8639 7.4384 124.9721
temp: 298.150 k
press: 1.00000 atm
elementType: 8 8 8 8 8 8 8 7 7 6 6 6 6 6 6 6 6 6 6 6 6 6 6 6 1 1 1 1 1 1 1 1 1 1 1 1 1 1 1 1 1 1
symmnumber: 1
zpe: 835999.8 jmol-1
zpe.correction: 0.318416 hartree
zpe.thermalcorrener: 0.343455 hartree
zpe.thermalcorrenthalpy: 0.344399 hartree
zpe.thermalcorrgfe: 0.259784 hartree
zpe.sumelectzpe: -1216.570373 hartree
zpe.sumelectthermal: -1216.545334 hartree
zpe.sumelectthermalent: -1216.544389 hartree
zpe.sumelectthermalfe: -1216.629005 hartree
dipole: -1.2691 5.1777 -0.6243
dipole: 5.3674
quadrupole: -114.4657 -144.8870 -141.9067
quadrupole: -23.9107 11.5635 10.1575
quadrupole: 19.2874 -11.1339 -8.1536 -23.9107 11.5635 10.1575
hfenergy: -1216.8887886 hartree
pointgroup: C01 [X(C15H18N2O7)]
dipole: 0.5106279 -2.0416087 0.1742877 debye
polarizability: 408.7923877|-1.5763288|232.4513325|9.9409051|1.3170286|130.6916498 unknown
InChI: InChI=1S/C15H18N2O7/c1-4-23-14(18)9-12(15(19)24-5-2)16-11-7-6-10(22-3)8-13(11)17(20)21/h6-9,16H,4-5H2,1-3H3
charge 0 multiplicity 1
42 atoms
O  5.417812 -0.545113 -0.61324
O  -1.270716 -1.20204 1.181726
O  -4.76368 1.064657 -1.215959
O  -1.169459 -2.192004 -0.933768
O  0.884145 3.384998 -0.389676
O  3.069361 3.665805 0.177485
O  -3.924861 -0.921537 -0.290775
N  -0.045553 0.978966 -0.762603
N  2.099124 2.911034 -0.206307
C  1.287601 0.551656 -0.737402
C  2.351474 1.489985 -0.461092
C  1.68412 -0.787345 -1.02104
C  3.705428 1.0882 -0.424096
C  4.053039 -0.249161 -0.674239
C  -1.237839 0.262512 -0.682203
C  3.028154 -1.186075 -0.986776
C  -2.432762 0.881899 -0.981916
C  -1.232356 -1.181944 -0.196602
C  -1.448799 -2.546804 1.825809
C  -3.725829 0.227204 -0.778826
C  -6.149532 0.534478 -1.051405
C  -0.097302 -3.224468 2.062433
C  5.829461 -1.926482 -0.886581
C  -6.683092 0.832598 0.353394
H  -0.115577 2.018031 -0.761844
H  0.929995 -1.51957 -1.314234
H  4.477776 1.828207 -0.204292
H  3.26996 -2.225128 -1.228347
H  -2.447159 1.903647 -1.373841
H  -1.963964 -2.303471 2.768039
H  -2.107576 -3.147195 1.175755
H  -6.137735 -0.551302 -1.252652
H  -6.722545 1.06117 -1.831372
H  0.388606 -3.482758 1.106815
H  0.575934 -2.571479 2.644087
H  -0.250822 -4.15823 2.634805
H  5.566459 -2.228058 -1.918825
H  5.378249 -2.631694 -0.162149
H  6.922414 -1.924654 -0.76937
H  -6.101698 0.287296 1.115497
H  -6.634803 1.913499 0.571205
H  -7.738749 0.511068 0.427981
